program: Orca
programVersion: 5.0.2
elementType: O O O C C C C C C C C C C C C C C C C C C C H H H H H H H H H H H H H H H H H H H H H H H H H H
charge: 0
multiplicity: 1
keywords: wb97x-d3
keywords: def2-TZVPP
keywords: def2/J RIJCOSX
keywords: DEFGRID2
keywords: scfconv7
keywords: smallprint printgap noloewdin
keywords: NOSOSCF
formula: C19H26O3
InChI: InChI=1/C19H26O3/c1-7-8-13-12(4)16(10-15(13)20)22-18(21)17-14(9-11(2)3)19(17,5)6/h7,9,14,16-17H,1,8,10H2,2-6H3
48 atoms
O  -0.15656 -0.219447 0.709274
O  0.084372 0.204949 2.887605
O  -3.893579 2.290728 -0.271585
C  2.799523 -1.195022 0.98656
C  2.672081 0.083869 0.210841
C  2.037544 -0.021268 1.573959
C  4.121958 -1.512069 1.640496
C  2.074627 -2.425308 0.499938
C  3.819868 1.005585 0.012664
C  0.57512 -0.003834 1.810528
C  4.646785 0.980156 -1.033125
C  -1.57583 -0.189468 0.86632
C  4.530871 -0.014237 -2.14774
C  5.764768 1.967915 -1.171649
C  -2.148711 1.214461 1.03463
C  -2.190952 -0.71516 -0.405647
C  -3.100173 0.127892 -0.909851
C  -3.167002 1.350221 -0.081937
C  -1.803516 -2.050936 -0.929349
C  -4.008012 -0.057214 -2.082423
C  -5.293285 -0.701849 -1.647655
C  -6.462099 -0.081286 -1.581786
H  1.971294 0.037287 -0.617133
H  2.558123 0.480966 2.382913
H  3.98261 -2.196555 2.478952
H  4.794788 -1.990083 0.925906
H  4.626836 -0.622464 2.013874
H  1.801731 -3.075538 1.33361
H  1.168352 -2.194279 -0.054034
H  2.726598 -2.999342 -0.161428
H  3.980018 1.760511 0.77735
H  -1.854097 -0.834233 1.70675
H  3.741599 -0.74599 -1.985632
H  5.468473 -0.560962 -2.275139
H  4.335411 0.488114 -3.098647
H  5.654826 2.559118 -2.084197
H  6.730436 1.461303 -1.243179
H  5.808409 2.657934 -0.329972
H  -1.381986 1.983035 0.919589
H  -2.610985 1.372738 2.008397
H  -0.773163 -2.043474 -1.289609
H  -1.855486 -2.807862 -0.143847
H  -2.440231 -2.373658 -1.750794
H  -3.523267 -0.667188 -2.848929
H  -4.215584 0.915576 -2.531158
H  -5.223335 -1.742718 -1.344756
H  -7.35369 -0.590833 -1.242592
H  -6.567465 0.961322 -1.853269
totalener: -965.40206416 hartree
nucrepener: 1799.87578543 hartree
electener: -2765.27784958 hartree
oneelecener: -4885.61602435 hartree
twoeener: 2120.33817476 hartree
kineticenergy: 961.04791155 hartree
xcener: -95.137203839726 hartree
chargesum: -0.0000000
charge: -0.289154 -0.355535 -0.326425 0.113858 0.010689 -0.113805 -0.243787 -0.266847 -0.219693 0.323137 -0.021863 0.210295 -0.237797 -0.210683 -0.148850 -0.043008 -0.025262 0.231258 -0.290117 -0.127121 -0.150303 -0.194164 0.097363 0.082970 0.096544 0.085489 0.082187 0.100267 0.062059 0.088084 0.092043 0.090938 0.076905 0.086144 0.095482 0.086685 0.084079 0.080398 0.088249 0.098729 0.114192 0.106176 0.096090 0.097141 0.093002 0.102296 0.100257 0.091406
qa: -0.2892 -0.3555 -0.3264 0.1139 0.0107 -0.1138 -0.2438 -0.2668 -0.2197 0.3231 -0.0219 0.2103 -0.2378 -0.2107 -0.1489 -0.0430 -0.0253 0.2313 -0.2901 -0.1271 -0.1503 -0.1942 0.0974 0.0830 0.0965 0.0855 0.0822 0.1003 0.0621 0.0881 0.0920 0.0909 0.0769 0.0861 0.0955 0.0867 0.0841 0.0804 0.0882 0.0987 0.1142 0.1062 0.0961 0.0971 0.0930 0.1023 0.1003 0.0914
va: 2.0941 2.1552 2.1727 3.6996 3.7671 3.9275 3.9127 3.9238 3.8721 4.2685 3.7371 3.7837 3.9448 3.9414 3.8888 3.6950 3.4334 4.1092 3.9553 3.8804 3.8436 3.9876 1.0209 1.0331 1.0041 1.0037 1.0082 1.0034 1.0159 1.0052 1.0149 1.0187 1.0102 1.0006 1.0009 0.9980 0.9989 1.0108 1.0282 1.0275 0.9933 0.9990 1.0082 1.0031 1.0296 1.0086 1.0072 1.0195
dispcorr: -0.023536721 hartree
energy: -965.425600876752
dipole: 20.33434 -19.04960 1.28474 -9.96198 8.55307 -1.40891 -9.82359 8.95633 -0.86726
magnitude: 2.09469 au
magnitude: 5.32428 debye
