program: Orca
programVersion: 5.0.2
elementType: O O O C C C C C C C C C C C C C C C C C C C H H H H H H H H H H H H H H H H H H H H H H H H H H
charge: 0
multiplicity: 1
keywords: wb97x-d3
keywords: def2-TZVPP
keywords: def2/J RIJCOSX
keywords: DEFGRID2
keywords: scfconv7
keywords: smallprint printgap noloewdin
keywords: NOSOSCF
formula: C19H26O3
InChI: InChI=1/C19H26O3/c1-7-8-13-12(4)16(10-15(13)20)22-18(21)17-14(9-11(2)3)19(17,5)6/h7,9,14,16-17H,1,8,10H2,2-6H3
48 atoms
O  -0.568368 0.200889 0.915949
O  0.520914 -1.754933 1.058525
O  -5.069873 1.106674 1.226959
C  2.947409 0.138995 1.701674
C  3.021637 -0.346063 0.286089
C  1.741521 0.284235 0.790542
C  3.653507 1.421864 2.071191
C  2.952021 -0.879313 2.814746
C  3.812877 0.345539 -0.752331
C  0.535537 -0.557583 0.939574
C  4.80822 -0.179858 -1.469402
C  -1.845894 -0.430141 1.022801
C  5.311729 -1.583614 -1.321967
C  5.520683 0.634599 -2.507383
C  -2.802636 0.451112 1.815393
C  -2.481846 -0.567542 -0.339825
C  -3.710583 -0.034692 -0.37365
C  -4.026868 0.584187 0.926588
C  -1.760665 -1.250448 -1.44326
C  -4.668371 0.019146 -1.520907
C  -4.416063 1.226094 -2.375556
C  -4.068558 1.18565 -3.654109
H  2.957667 -1.424669 0.188564
H  1.538186 1.29778 0.461923
H  3.22638 1.847108 2.980861
H  4.712135 1.231777 2.255953
H  3.590683 2.18062 1.292456
H  2.418661 -0.502183 3.689778
H  2.498856 -1.8249 2.52845
H  3.980461 -1.08073 3.119814
H  3.550604 1.381878 -0.944684
H  -1.727003 -1.416296 1.478811
H  4.767167 -2.167661 -0.583532
H  6.363562 -1.581223 -1.025172
H  5.260664 -2.116563 -2.274503
H  5.135663 1.651866 -2.567146
H  5.422699 0.180919 -3.496937
H  6.591572 0.69218 -2.297016
H  -2.373768 1.440354 1.987841
H  -3.06959 0.04061 2.789381
H  -1.361924 -2.211511 -1.115832
H  -2.397949 -1.410542 -2.310285
H  -0.908917 -0.65124 -1.772743
H  -5.685816 0.062354 -1.122561
H  -4.599201 -0.887254 -2.125947
H  -4.522697 2.185781 -1.879805
H  -3.88948 2.088474 -4.221617
H  -3.951111 0.248499 -4.185226
totalener: -965.40700153 hartree
nucrepener: 1776.83911851 hartree
electener: -2742.24612004 hartree
oneelecener: -4839.65105128 hartree
twoeener: 2097.40493124 hartree
kineticenergy: 961.04274806 hartree
xcener: -95.138478460254 hartree
chargesum: -0.0000000
charge: -0.274800 -0.391903 -0.330606 0.109706 0.031693 -0.125242 -0.236819 -0.265978 -0.194908 0.328987 -0.042478 0.228299 -0.236235 -0.205173 -0.139822 -0.079165 -0.037715 0.222565 -0.231324 -0.119734 -0.140783 -0.217405 0.093015 0.073315 0.091299 0.091899 0.071904 0.085708 0.101399 0.086066 0.076676 0.098830 0.083092 0.086575 0.086709 0.076955 0.085937 0.083795 0.088944 0.087359 0.119340 0.084229 0.103136 0.103607 0.087847 0.121511 0.102837 0.076858
qa: -0.2748 -0.3919 -0.3306 0.1097 0.0317 -0.1252 -0.2368 -0.2660 -0.1949 0.3290 -0.0425 0.2283 -0.2362 -0.2052 -0.1398 -0.0792 -0.0377 0.2226 -0.2313 -0.1197 -0.1408 -0.2174 0.0930 0.0733 0.0913 0.0919 0.0719 0.0857 0.1014 0.0861 0.0767 0.0988 0.0831 0.0866 0.0867 0.0770 0.0859 0.0838 0.0889 0.0874 0.1193 0.0842 0.1031 0.1036 0.0878 0.1215 0.1028 0.0769
va: 2.1224 2.1063 2.1680 3.7279 3.7690 3.9185 3.9103 3.9142 3.8917 4.2405 3.8042 3.7453 3.9479 3.9373 3.8712 3.7875 3.3907 4.1282 3.9373 3.8984 3.8350 3.9619 1.0342 1.0415 1.0049 1.0052 1.0100 1.0026 1.0207 1.0017 1.0195 1.0295 1.0141 0.9995 0.9993 1.0121 0.9982 0.9986 1.0329 1.0282 1.0084 1.0107 1.0027 1.0236 1.0033 1.0103 1.0104 1.0154
dispcorr: -0.021952578 hartree
energy: -965.428954104727
dipole: 25.73306 -24.24442 1.48864 -0.51470 0.37825 -0.13645 -8.63983 8.12559 -0.51425
magnitude: 1.58086 au
magnitude: 4.01824 debye
