program: Orca
programVersion: 5.0.2
elementType: O O O C C C C C C C C C C C C C C C C C C C H H H H H H H H H H H H H H H H H H H H H H H H H H
charge: 0
multiplicity: 1
keywords: wb97x-d3
keywords: def2-TZVPP
keywords: def2/J RIJCOSX
keywords: DEFGRID2
keywords: scfconv7
keywords: smallprint printgap noloewdin
keywords: NOSOSCF
formula: C19H26O3
InChI: InChI=1/C19H26O3/c1-7-8-13-12(4)16(10-15(13)20)22-18(21)17-14(9-11(2)3)19(17,5)6/h7,9,14,16-17H,1,8,10H2,2-6H3
48 atoms
O  -0.288473 0.022547 0.946673
O  0.573688 -1.99863 0.488833
O  -4.733848 1.253522 1.230933
C  3.057427 -0.784845 2.011802
C  3.287956 -0.798968 0.540416
C  2.012357 -0.184018 1.084008
C  3.808401 0.215334 2.858297
C  2.794999 -2.08877 2.724615
C  4.314469 0.051272 -0.115068
C  0.722255 -0.848146 0.810612
C  4.218032 0.554871 -1.346244
C  -1.621473 -0.414149 0.681609
C  3.026518 0.340544 -2.228868
C  5.316444 1.38094 -1.943234
C  -2.594865 0.189229 1.685942
C  -2.084696 0.094029 -0.661772
C  -3.247252 0.75389 -0.573703
C  -3.689854 0.804252 0.832206
C  -1.296411 -0.195829 -1.885954
C  -4.07201 1.329945 -1.682212
C  -4.874126 0.267944 -2.373755
C  -4.805886 -0.007406 -3.668927
H  3.126124 -1.768291 0.074791
H  1.965075 0.898853 1.092718
H  3.96429 1.164586 2.345904
H  3.262585 0.423363 3.7799
H  4.788816 -0.1762 3.137402
H  2.194344 -1.929352 3.622114
H  2.280889 -2.815941 2.101041
H  3.742591 -2.530629 3.03828
H  5.221685 0.244967 0.450082
H  -1.654806 -1.506672 0.692441
H  2.266053 -0.290731 -1.773615
H  3.324222 -0.12689 -3.170629
H  2.56205 1.294901 -2.491335
H  4.953853 2.373589 -2.221907
H  5.700581 0.922483 -2.857788
H  6.152239 1.509786 -1.256726
H  -2.115142 0.973302 2.275518
H  -3.006013 -0.537773 2.386471
H  -1.817763 0.109075 -2.790427
H  -0.333477 0.320005 -1.857834
H  -1.078613 -1.262702 -1.960063
H  -3.438727 1.850599 -2.403865
H  -4.749623 2.07534 -1.257113
H  -5.547414 -0.301259 -1.740455
H  -5.408709 -0.785735 -4.115983
H  -4.150544 0.541007 -4.335438
totalener: -965.40571607 hartree
nucrepener: 1799.95917900 hartree
electener: -2765.36489507 hartree
oneelecener: -4885.82182522 hartree
twoeener: 2120.45693015 hartree
kineticenergy: 961.03772771 hartree
xcener: -95.137349183663 hartree
chargesum: 0.0000000
charge: -0.272423 -0.387348 -0.330496 0.126352 -0.022776 -0.101889 -0.275370 -0.255828 -0.239271 0.306477 0.002514 0.213635 -0.225351 -0.211296 -0.140256 -0.062348 -0.045739 0.232155 -0.232753 -0.116318 -0.142956 -0.220609 0.107362 0.084628 0.084478 0.092143 0.092322 0.085802 0.101095 0.085523 0.094580 0.102202 0.065390 0.093928 0.089304 0.085121 0.087004 0.079755 0.089710 0.086421 0.087824 0.094469 0.116266 0.090278 0.102406 0.120641 0.103775 0.079469
qa: -0.2724 -0.3873 -0.3305 0.1264 -0.0228 -0.1019 -0.2754 -0.2558 -0.2393 0.3065 0.0025 0.2136 -0.2254 -0.2113 -0.1403 -0.0623 -0.0457 0.2322 -0.2328 -0.1163 -0.1430 -0.2206 0.1074 0.0846 0.0845 0.0921 0.0923 0.0858 0.1011 0.0855 0.0946 0.1022 0.0654 0.0939 0.0893 0.0851 0.0870 0.0798 0.0897 0.0864 0.0878 0.0945 0.1163 0.0903 0.1024 0.1206 0.1038 0.0795
va: 2.1124 2.1089 2.1688 3.7457 3.8186 3.8016 3.9118 3.9009 3.9060 4.2357 3.7249 3.7726 3.9464 3.9426 3.8828 3.7269 3.4014 4.1217 3.9286 3.8933 3.8350 3.9578 1.0259 1.0350 1.0045 1.0066 1.0008 1.0022 1.0199 1.0025 1.0094 1.0313 1.0180 1.0031 0.9987 0.9988 0.9985 1.0096 1.0312 1.0291 1.0162 1.0068 1.0067 1.0025 1.0255 1.0110 1.0112 1.0147
dispcorr: -0.023229504 hartree
energy: -965.428945579020
dipole: 20.56214 -19.13598 1.42616 0.85650 -0.71876 0.13774 -8.16637 7.64999 -0.51639
magnitude: 1.52301 au
magnitude: 3.87119 debye
