program: Orca
programVersion: 5.0.2
elementType: O O O C C C C C C C C C C C C C C C C C C C H H H H H H H H H H H H H H H H H H H H H H H H H H
charge: 0
multiplicity: 1
keywords: wb97x-d3
keywords: def2-TZVPP
keywords: def2/J RIJCOSX
keywords: DEFGRID2
keywords: scfconv7
keywords: smallprint printgap noloewdin
keywords: NOSOSCF
formula: C19H26O3
InChI: InChI=1/C19H26O3/c1-7-8-13-12(4)16(10-15(13)20)22-18(21)17-14(9-11(2)3)19(17,5)6/h7,9,14,16-17H,1,8,10H2,2-6H3
48 atoms
O  -0.42455 0.35089 1.674439
O  -0.160567 0.112236 -0.535799
O  -4.24105 2.383247 -0.362031
C  2.402948 -1.442142 0.438029
C  2.769085 -0.106594 -0.13549
C  1.702538 -0.186792 0.932502
C  3.344536 -2.103824 1.416081
C  1.678004 -2.430862 -0.441714
C  4.052896 0.5587 0.165149
C  0.297487 0.103893 0.577453
C  4.955775 0.977568 -0.724006
C  -1.817978 0.628717 1.556781
C  4.820026 0.828146 -2.208671
C  6.221267 1.646928 -0.277675
C  -2.198155 1.940037 0.876227
C  -2.627896 -0.424992 0.841519
C  -3.592837 0.124448 0.09269
C  -3.468824 1.593994 0.117913
C  -2.381662 -1.871024 1.072276
C  -4.663547 -0.566206 -0.679889
C  -4.225078 -1.113388 -2.008896
C  -2.999253 -1.073258 -2.512224
H  2.368563 0.070638 -1.127856
H  1.98388 0.129943 1.931042
H  3.817025 -1.39745 2.096946
H  2.813362 -2.839654 2.021949
H  4.141355 -2.624162 0.881875
H  1.05848 -3.104114 0.155526
H  1.04096 -1.953812 -1.18241
H  2.404394 -3.045793 -0.975861
H  4.274422 0.719328 1.216261
H  -2.137979 0.647831 2.602823
H  4.863314 1.802098 -2.701552
H  3.898638 0.341217 -2.517973
H  5.650112 0.242137 -2.610214
H  6.301241 2.653694 -0.695218
H  7.09962 1.096303 -0.623636
H  6.283268 1.72923 0.806655
H  -1.444491 2.25501 0.153013
H  -2.35713 2.765724 1.568997
H  -3.211715 -2.481391 0.721409
H  -1.49218 -2.200948 0.531117
H  -2.213091 -2.084661 2.12924
H  -5.486803 0.135162 -0.844201
H  -5.089975 -1.38377 -0.088262
H  -5.017149 -1.577971 -2.588343
H  -2.790845 -1.495403 -3.485999
H  -2.1675 -0.617988 -1.991116
totalener: -965.40356696 hartree
nucrepener: 1832.04511574 hartree
electener: -2797.44868270 hartree
oneelecener: -4950.29407480 hartree
twoeener: 2152.84539210 hartree
kineticenergy: 961.04399499 hartree
xcener: -95.143873305619 hartree
chargesum: -0.0000000
charge: -0.272967 -0.401864 -0.327676 0.116072 0.037660 -0.107077 -0.240003 -0.287135 -0.196351 0.323193 -0.043390 0.273372 -0.236725 -0.204877 -0.159375 -0.060120 -0.087733 0.235076 -0.249141 -0.102565 -0.158635 -0.213629 0.092872 0.071543 0.072123 0.090611 0.092824 0.079336 0.106467 0.094665 0.074953 0.100933 0.088288 0.083110 0.085514 0.086257 0.084042 0.076533 0.102325 0.086887 0.098685 0.105192 0.107059 0.096174 0.082463 0.100920 0.094504 0.109611
qa: -0.2730 -0.4019 -0.3277 0.1161 0.0377 -0.1071 -0.2400 -0.2871 -0.1964 0.3232 -0.0434 0.2734 -0.2367 -0.2049 -0.1594 -0.0601 -0.0877 0.2351 -0.2491 -0.1026 -0.1586 -0.2136 0.0929 0.0715 0.0721 0.0906 0.0928 0.0793 0.1065 0.0947 0.0750 0.1009 0.0883 0.0831 0.0855 0.0863 0.0840 0.0765 0.1023 0.0869 0.0987 0.1052 0.1071 0.0962 0.0825 0.1009 0.0945 0.1096
va: 2.1391 2.0824 2.1762 3.6997 3.7861 3.9150 3.9113 3.9131 3.8948 4.2254 3.8100 3.7718 3.9481 3.9368 3.8615 3.6688 3.4511 4.1089 3.9482 3.8620 3.8774 3.9186 1.0355 1.0408 1.0110 1.0046 1.0049 1.0026 1.0144 1.0052 1.0198 0.9928 0.9992 1.0147 0.9996 0.9982 0.9986 1.0122 1.0301 1.0298 1.0051 1.0006 1.0020 1.0234 0.9993 1.0076 1.0130 1.0271
dispcorr: -0.024278727 hartree
energy: -965.427845683543
dipole: 23.09097 -21.78415 1.30682 -11.27509 10.10934 -1.16574 -4.07159 5.04215 0.97056
magnitude: 2.00218 au
magnitude: 5.08914 debye
