program: Orca
programVersion: 5.0.2
elementType: O O O C C C C C C C C C C C C C C C C C C C H H H H H H H H H H H H H H H H H H H H H H H H H H
charge: 0
multiplicity: 1
keywords: wb97x-d3
keywords: def2-TZVPP
keywords: def2/J RIJCOSX
keywords: DEFGRID2
keywords: scfconv7
keywords: smallprint printgap noloewdin
keywords: NOSOSCF
formula: C19H26O3
InChI: InChI=1/C19H26O3/c1-7-8-13-12(4)16(10-15(13)20)22-18(21)17-14(9-11(2)3)19(17,5)6/h7,9,14,16-17H,1,8,10H2,2-6H3
48 atoms
O  -0.209029 0.350217 1.534733
O  -0.077126 -0.162303 -0.64041
O  -3.808566 2.476314 -0.750881
C  2.41943 -1.791799 0.420695
C  2.832688 -0.590616 -0.358088
C  1.83258 -0.43211 0.77023
C  3.367365 -2.365105 1.447116
C  1.567597 -2.840048 -0.252587
C  4.186876 0.00957 -0.254774
C  0.435723 -0.081443 0.446513
C  4.47389 1.284846 -0.5206
C  -1.569664 0.76235 1.428744
C  3.441125 2.291077 -0.927429
C  5.875928 1.806291 -0.435145
C  -1.83846 2.010399 0.592175
C  -2.517735 -0.279251 0.887076
C  -3.43561 0.263785 0.077259
C  -3.13771 1.692786 -0.12988
C  -2.425584 -1.696174 1.320853
C  -4.603877 -0.397396 -0.569372
C  -4.283204 -1.163108 -1.821615
C  -3.081953 -1.331683 -2.356427
H  2.372834 -0.521895 -1.340684
H  2.20329 0.001368 1.691959
H  3.942593 -1.596531 1.962953
H  2.817272 -2.927899 2.202923
H  4.075127 -3.050821 0.976732
H  0.938577 -3.359441 0.473996
H  0.922806 -2.428368 -1.02552
H  2.208736 -3.588202 -0.722294
H  4.999771 -0.654335 0.024284
H  -1.835372 0.949515 2.47336
H  3.439781 3.142506 -0.241791
H  2.432951 1.882226 -0.956001
H  3.664772 2.693585 -1.918895
H  6.585219 1.031385 -0.146988
H  5.94905 2.617878 0.293054
H  6.200536 2.219039 -1.393482
H  -1.06095 2.184517 -0.152912
H  -1.930532 2.919653 1.186068
H  -3.331591 -2.250101 1.082065
H  -1.600015 -2.199118 0.812306
H  -2.239549 -1.776488 2.393222
H  -5.349586 0.366228 -0.809707
H  -5.095674 -1.072936 0.139032
H  -5.145503 -1.603073 -2.31348
H  -2.960956 -1.899274 -3.269171
H  -2.184536 -0.912718 -1.920898
totalener: -965.40289455 hartree
nucrepener: 1852.69493575 hartree
electener: -2818.09783030 hartree
oneelecener: -4991.65201423 hartree
twoeener: 2173.55418394 hartree
kineticenergy: 961.04212745 hartree
xcener: -95.142556130644 hartree
chargesum: 0.0000000
charge: -0.270825 -0.403325 -0.327832 0.146607 -0.042150 -0.089599 -0.283001 -0.276500 -0.231873 0.318067 -0.003615 0.276186 -0.225172 -0.210836 -0.158619 -0.053450 -0.097018 0.236386 -0.248805 -0.100390 -0.157699 -0.213060 0.107570 0.080428 0.083681 0.091472 0.094757 0.081727 0.105030 0.093064 0.095187 0.099838 0.085289 0.075082 0.092546 0.078012 0.085376 0.087181 0.101189 0.087859 0.098103 0.105228 0.105936 0.094872 0.082201 0.100207 0.094195 0.110495
qa: -0.2708 -0.4033 -0.3278 0.1466 -0.0422 -0.0896 -0.2830 -0.2765 -0.2319 0.3181 -0.0036 0.2762 -0.2252 -0.2108 -0.1586 -0.0534 -0.0970 0.2364 -0.2488 -0.1004 -0.1577 -0.2131 0.1076 0.0804 0.0837 0.0915 0.0948 0.0817 0.1050 0.0931 0.0952 0.0998 0.0853 0.0751 0.0925 0.0780 0.0854 0.0872 0.1012 0.0879 0.0981 0.1052 0.1059 0.0949 0.0822 0.1002 0.0942 0.1105
va: 2.1348 2.0755 2.1770 3.7149 3.8394 3.8191 3.9128 3.8960 3.8930 4.2080 3.7347 3.7734 3.9454 3.9409 3.8560 3.6673 3.4608 4.1107 3.9500 3.8600 3.8786 3.9197 1.0259 1.0357 1.0049 1.0060 0.9999 1.0021 1.0139 1.0060 1.0093 0.9921 1.0007 1.0219 1.0016 1.0098 0.9990 0.9984 1.0289 1.0283 1.0051 1.0004 1.0021 1.0227 0.9992 1.0076 1.0130 1.0254
dispcorr: -0.025002962 hartree
energy: -965.427897514914
dipole: 18.94875 -17.82763 1.12112 -9.06558 8.13359 -0.93199 -0.38324 1.61862 1.23538
magnitude: 1.91094 au
magnitude: 4.85722 debye
