program: Gaussian 09
title: 000060685
version: EM64L-G09RevD.01
frameworkgroup: C1[X(C23H26N4O4)]
method: RPBEPBE
basis: SDD
operation: Freq
keyword: #p
keyword: freq=noraman
keyword: PBEPBE/SDD
title: #p freq=noraman PBEPBE/SDD
converged: YES YES NO NO
title: Mulliken charges:
elementType: O O O O N N N N C C C C C C C C C C C C C C C C C C C C C C C H H H H H H H H H H H H H H H H H H H H H H H H H H
charge: -0.246826 -0.198365 -0.237970 -0.273516 -0.189713 -0.436683 -0.098995 -0.359969 -0.055253 0.156294 0.375215 0.442840 0.190931 -0.315361 -0.527607 -0.351409 -0.339335 -0.405414 -0.312746 -0.318030 -0.326373 -0.392473 -0.409328 -0.395289 0.296743 -0.249457 -0.245934 -0.227225 -0.248581 -0.242233 -0.244953 0.331598 0.195299 0.230283 0.253759 0.287115 0.196270 0.208356 0.212608 0.201715 0.252024 0.235303 0.214044 0.190890 0.191843 0.215779 0.270562 0.259388 0.254216 0.305697 0.303999 0.229380 0.227777 0.227599 0.231314 0.229883 0.230313
chargesum: 0.00000
title: Mulliken charges with hydrogens summed into heavy atoms:
elementType: O O O O N N N N C C C C C C C C C C C C C C C C C C C C C C C
charge: -0.246826 -0.198365 -0.237970 -0.273516 -0.189713 -0.105085 -0.098995 -0.055969 -0.055253 0.156294 0.375215 0.442840 0.190931 0.110221 0.013266 0.053217 0.074988 0.081913 0.092188 0.089592 -0.055810 -0.133085 -0.155112 -0.089592 0.296743 -0.020077 -0.018156 0.000374 -0.017267 -0.012350 -0.014641
polarizability: 3.28210568e+02 7.57662204e+00 2.73412299e+02 -2.04796419e+01 2.72699146e+00 2.38237829e+02
1716.lowfreq: -14.9967 -1.9777 0.0004 0.0006 0.0009 2.6985 8.1158 8.7782 19.1565
frequency: -7.7726 8.2055 18.8983 29.5769 36.2615 45.0501 47.5129 57.8797 70.5566 79.8218 84.4721 102.6871 106.9584 118.7795 141.4187 191.7964 218.8793 230.9537 234.9723 246.5652 249.8313 256.5644 268.6228 292.6017 320.7282 323.3182 329.8270 351.0649 359.0671 368.8741 403.1173 403.4074 407.3153 430.7157 467.2869 482.1687 496.8643 504.1047 526.0549 538.5806 571.9659 593.4845 595.5160 615.2368 616.1065 616.6277 663.9048 668.4850 679.3031 690.6450 705.4329 709.0893 717.4063 737.5862 766.3312 767.9934 780.6000 784.0092 807.4263 839.2097 856.4019 866.6819 869.1226 882.3690 899.7475 906.1572 922.3265 939.4110 943.5360 981.3353 988.7421 990.2487 991.0412 997.8488 997.9316 1009.0778 1022.4070 1025.8515 1030.0688 1030.8639 1042.9384 1051.1154 1059.4131 1065.6745 1071.4993 1089.9633 1092.6242 1099.8424 1109.4513 1128.1232 1134.6104 1160.9599 1173.0881 1173.9948 1181.5235 1190.7514 1191.3975 1205.0571 1210.6470 1213.5252 1232.1513 1243.0054 1262.5902 1273.8319 1294.9783 1303.1015 1315.4996 1318.1741 1322.7536 1333.5840 1335.0523 1339.7228 1349.5205 1351.0015 1367.1928 1371.5635 1377.8624 1382.1084 1387.4845 1391.6485 1430.5865 1433.9629 1438.4565 1442.1007 1445.6471 1449.9423 1450.7009 1460.3167 1480.9890 1481.3183 1486.4390 1498.2291 1589.7039 1593.2927 1609.1417 1611.4317 1630.9709 1655.4209 1717.1104 2871.5705 2879.9515 2905.1319 2953.0807 2957.4892 3001.3587 3020.1961 3026.8619 3029.1758 3044.6488 3065.4755 3080.5611 3084.1385 3097.6527 3111.2288 3125.9565 3126.5793 3136.5712 3137.6606 3149.3084 3149.5841 3158.4139 3163.8990 3168.7487 3548.0413 3597.6033
redmass: 5.4277 6.0648 3.1011 4.4512 4.3268 5.0352 4.6968 6.0739 4.9397 4.5949 7.1566 6.5014 5.2663 3.3855 10.8821 4.8093 4.5227 2.3731 3.4466 2.5334 2.9272 3.0335 7.0288 5.6999 4.1532 4.2486 3.9790 5.3599 5.3957 2.9941 2.7609 2.1589 2.8661 5.5496 2.7692 3.5996 3.2040 1.9157 1.8373 1.8599 1.9451 6.0453 4.9902 6.3856 4.5143 3.1625 6.1884 4.1510 4.2279 6.9320 1.8499 2.2284 3.2250 5.1542 2.2454 2.7160 1.8038 1.8207 3.6432 1.6088 1.2478 1.2432 4.3433 3.1333 2.5181 3.2811 2.7915 1.6755 1.6254 1.3875 2.7006 5.7394 1.8844 1.7675 1.8500 1.3413 3.3714 2.5721 2.7011 2.3493 2.8738 2.2967 2.4455 2.6424 2.6104 3.2494 1.6579 2.1622 2.4180 3.0828 2.6472 2.3478 1.0629 1.0971 2.6415 1.0654 1.1769 1.2915 2.9090 1.4395 1.7850 3.5409 1.3569 1.3136 1.2956 1.1735 1.5439 1.3481 1.3052 1.2420 1.3957 1.5541 1.3267 1.6137 1.3672 1.2797 5.8531 8.0577 4.8138 1.3854 1.1463 2.2332 2.2490 1.0822 1.0881 1.0922 1.0963 1.1010 1.0944 2.2150 2.0916 1.8648 5.9374 6.2406 5.7668 5.9656 7.1564 11.6960 9.9707 1.0698 1.0697 1.0681 1.0665 1.0666 1.0579 1.0919 1.0900 1.0600 1.0894 1.1032 1.0961 1.0977 1.1052 1.0923 1.0857 1.0848 1.0883 1.0905 1.0940 1.0938 1.0958 1.1012 1.1008 1.0778 1.0799
irintensity: 0.1463 0.2007 0.5918 0.6534 2.9336 0.6867 0.1845 1.3488 2.2226 2.7351 4.1182 1.4964 1.9191 0.7094 3.7608 2.7627 0.5535 5.8831 3.3733 3.5723 6.5015 3.0127 4.0221 1.4768 9.3821 5.1531 2.7428 7.1878 21.4921 10.4912 0.0579 0.7669 0.7545 7.9211 1.6140 15.5449 16.2860 78.0890 107.3619 67.2151 17.6714 24.3159 14.8639 2.3523 0.3107 4.6410 9.0387 11.1887 1.8998 11.3108 42.2868 33.2917 47.2013 18.7848 46.1998 5.8939 21.0974 10.7490 22.6312 0.2081 0.8222 0.1433 5.6283 15.1832 1.2446 11.2189 17.0075 5.7477 16.6260 1.0849 0.5262 1.3790 0.7593 12.1585 12.8104 0.6271 1.1608 2.7829 17.6174 5.6150 9.9963 33.2738 10.1844 14.3568 1.2957 41.3527 3.5360 14.8400 3.5477 42.2584 73.6598 13.2120 0.3430 0.5881 4.8531 1.0765 5.7924 0.6201 8.4524 27.8984 172.3811 28.4511 13.3889 4.8450 2.2745 16.2324 33.5466 0.8209 0.5270 0.5871 2.4827 31.8194 8.2142 27.5330 1.2822 5.4821 4.1711 11.9744 213.2011 4.8318 73.6539 18.9399 11.6829 3.1424 11.2485 15.2212 17.4487 16.5244 9.3065 18.2365 21.7482 209.6011 0.1284 0.3262 6.1435 3.2310 222.5683 467.0202 277.9530 55.3887 64.6422 80.8202 35.0782 109.8451 28.8749 7.4446 63.1538 34.9194 35.9678 4.3757 41.2126 30.0890 15.0439 27.3051 2.0525 0.2754 6.4064 5.1237 40.0577 6.7252 22.3269 33.7833 15.7107 22.9581 49.6513
temp: 298.150 k
press: 1.00000 atm
elementType: 8 8 8 8 7 7 7 7 6 6 6 6 6 6 6 6 6 6 6 6 6 6 6 6 6 6 6 6 6 6 6 1 1 1 1 1 1 1 1 1 1 1 1 1 1 1 1 1 1 1 1 1 1 1 1 1 1
symmnumber: 1
zpe: 1205982.7 jmol-1
zpe.correction: 0.459335 hartree
zpe.thermalcorrener: 0.486602 hartree
zpe.thermalcorrenthalpy: 0.487546 hartree
zpe.thermalcorrgfe: 0.398200 hartree
zpe.sumelectzpe: -1409.706498 hartree
zpe.sumelectthermal: -1409.679231 hartree
zpe.sumelectthermalent: -1409.678287 hartree
zpe.sumelectthermalfe: -1409.767633 hartree
dipole: -0.7725 -2.0296 1.8724
dipole: 2.8674
quadrupole: -170.0733 -169.1388 -188.1270
quadrupole: -21.7746 -3.2523 -12.2802
quadrupole: 5.7064 6.6409 -12.3473 -21.7746 -3.2523 -12.2802
hfenergy: -1410.1658329 hartree
pointgroup: C01 [X(C23H26N4O4)]
dipole: -0.2842567 0.9017742 -0.615328 debye
polarizability: 328.3459592|-12.4236922|273.062081|16.837775|6.814859|238.4526565 unknown
InChI: InChI=1S/C23H26N4O4/c28-20(24-11-12-26-13-15-31-16-14-26)17-27-21(29)23(25-22(27)30,18-7-3-1-4-8-18)19-9-5-2-6-10-19/h1-10,24-25H,11-17H2
charge 0 multiplicity 1
57 atoms
O  7.44376 -1.878411 -1.127134
O  -0.748776 0.867396 -1.198632
O  -1.625386 2.158238 3.23254
O  1.486325 0.498026 1.384062
N  -0.963153 1.767437 0.970545
N  -2.73644 0.640498 1.767355
N  5.552714 0.269231 -0.617748
N  2.664406 2.377015 0.681155
C  -2.565975 0.101786 0.39385
C  -1.318316 0.92534 -0.084892
C  -3.748674 0.44537 -0.533027
C  -2.244015 -1.410518 0.462891
C  -1.781616 1.570461 2.135856
C  4.283937 1.029241 -0.682599
C  0.23103 2.591714 0.991218
C  6.222632 0.127205 -1.937612
C  5.393997 -1.068186 0.016713
C  3.974158 1.701086 0.679331
C  7.588834 -0.55446 -1.754786
C  6.767984 -1.737641 0.174242
C  -3.707172 0.023867 -1.887489
C  -3.259774 -2.37478 0.250817
C  -4.851472 1.205207 -0.078309
C  -0.946502 -1.838134 0.849119
C  1.507863 1.713174 1.027898
C  -4.761494 0.349667 -2.765688
C  -2.983914 -3.750833 0.41528
C  -5.911434 1.525034 -0.958623
C  -0.67458 -3.214043 1.005703
C  -5.871344 1.097188 -2.304094
C  -1.689789 -4.17541 0.791358
H  -3.337053 0.197941 2.460994
H  4.387281 1.813532 -1.457016
H  3.416301 0.390424 -0.973526
H  0.243585 3.258814 0.110058
H  0.181155 3.203594 1.911687
H  5.607532 -0.477008 -2.65056
H  6.369955 1.13208 -2.377093
H  4.925695 -0.95739 1.011421
H  4.731358 -1.72653 -0.598589
H  3.948136 0.93977 1.476666
H  4.766491 2.430115 0.92225
H  8.075136 -0.740458 -2.726732
H  8.24119 0.088903 -1.12528
H  7.399623 -1.133061 0.860422
H  6.66886 -2.763291 0.566204
H  -2.843796 -0.543811 -2.249362
H  -4.262674 -2.054846 -0.051885
H  -4.877013 1.556346 0.958345
H  -0.147389 -1.107393 1.029753
H  2.606495 3.338649 0.341299
H  -4.716696 0.022303 -3.810302
H  -3.777484 -4.487722 0.24817
H  -6.762357 2.110601 -0.592878
H  0.331687 -3.534478 1.297387
H  -6.691144 1.346518 -2.987049
H  -1.473789 -5.242668 0.914613
