program: Orca
programVersion: 5.0.2
elementType: O O O C C C C C C C C C C C C C C C C C C C H H H H H H H H H H H H H H H H H H H H H H H H H H
charge: 0
multiplicity: 1
keywords: wb97x-d3
keywords: def2-TZVPP
keywords: def2/J RIJCOSX
keywords: DEFGRID2
keywords: scfconv7
keywords: smallprint printgap noloewdin
keywords: NOSOSCF
formula: C19H26O3
InChI: InChI=1/C19H26O3/c1-7-8-13-12(4)16(10-15(13)20)22-18(21)17-14(9-11(2)3)19(17,5)6/h7,9,14,16-17H,1,8,10H2,2-6H3
48 atoms
O  -0.189712 0.348996 1.472486
O  -0.087078 -0.186041 -0.699365
O  -3.812826 2.461228 -0.785024
C  2.43027 -1.795771 0.36089
C  2.836022 -0.606188 -0.440797
C  1.843843 -0.430384 0.688691
C  3.388074 -2.346029 1.390556
C  1.574328 -2.856485 -0.286352
C  4.19256 -0.008268 -0.340683
C  0.440533 -0.092287 0.379235
C  4.46115 1.295304 -0.425394
C  -1.551128 0.760919 1.383225
C  3.405331 2.340151 -0.622842
C  5.863399 1.813598 -0.323296
C  -1.830829 2.00449 0.54345
C  -2.508377 -0.282659 0.862222
C  -3.43786 0.256895 0.063331
C  -3.138602 1.682851 -0.161319
C  -2.410406 -1.697049 1.302693
C  -4.619032 -0.405523 -0.558163
C  -4.324218 -1.177228 -1.812736
C  -3.134894 -1.345001 -2.373603
H  2.377849 -0.556839 -1.425986
H  2.222341 0.019595 1.599343
H  4.081165 -3.054435 0.932185
H  3.979877 -1.56546 1.868279
H  2.845123 -2.876936 2.174081
H  2.212121 -3.61463 -0.744464
H  0.948876 -3.360861 0.453755
H  0.92546 -2.459769 -1.063809
H  5.021617 -0.698712 -0.213873
H  -1.801768 0.954443 2.430409
H  3.339271 2.995373 0.249538
H  2.418079 1.921391 -0.803651
H  3.653495 2.981053 -1.471648
H  6.585897 1.014021 -0.164731
H  5.959411 2.522443 0.503028
H  6.150553 2.352295 -1.229483
H  -1.06121 2.177842 -0.209909
H  -1.918724 2.915828 1.134902
H  -1.594941 -2.203365 0.781364
H  -2.204391 -1.771764 2.371776
H  -3.321238 -2.251299 1.083828
H  -5.368059 0.358295 -0.787553
H  -5.098048 -1.076925 0.162827
H  -5.196064 -1.62205 -2.282949
H  -3.033175 -1.915236 -3.287016
H  -2.22915 -0.920794 -1.960776
totalener: -965.40272664 hartree
nucrepener: 1854.55685749 hartree
electener: -2819.95958413 hartree
oneelecener: -4995.37281199 hartree
twoeener: 2175.41322787 hartree
kineticenergy: 961.04657039 hartree
xcener: -95.143244043670 hartree
chargesum: -0.0000000
charge: -0.270354 -0.400443 -0.327655 0.141455 -0.023195 -0.110820 -0.276413 -0.279546 -0.245359 0.320410 -0.001995 0.273600 -0.223997 -0.210641 -0.157962 -0.050702 -0.098492 0.236580 -0.249190 -0.100024 -0.157826 -0.212949 0.109159 0.083329 0.092363 0.086108 0.091137 0.092626 0.081980 0.104882 0.094305 0.099572 0.089959 0.076230 0.091750 0.078760 0.084667 0.088330 0.101131 0.087733 0.105838 0.105847 0.098005 0.094658 0.082119 0.100039 0.094277 0.110715
qa: -0.2704 -0.4004 -0.3277 0.1415 -0.0232 -0.1108 -0.2764 -0.2795 -0.2454 0.3204 -0.0020 0.2736 -0.2240 -0.2106 -0.1580 -0.0507 -0.0985 0.2366 -0.2492 -0.1000 -0.1578 -0.2129 0.1092 0.0833 0.0924 0.0861 0.0911 0.0926 0.0820 0.1049 0.0943 0.0996 0.0900 0.0762 0.0918 0.0788 0.0847 0.0883 0.1011 0.0877 0.1058 0.1058 0.0980 0.0947 0.0821 0.1000 0.0943 0.1107
va: 2.1317 2.0812 2.1772 3.7086 3.8217 3.8272 3.9086 3.9021 3.9018 4.2012 3.7293 3.7753 3.9412 3.9424 3.8546 3.6663 3.4615 4.1113 3.9493 3.8598 3.8779 3.9197 1.0258 1.0341 1.0011 1.0050 1.0060 1.0060 1.0018 1.0141 1.0097 0.9921 0.9998 1.0209 1.0032 1.0094 0.9987 0.9992 1.0290 1.0282 1.0005 1.0021 1.0052 1.0224 0.9993 1.0077 1.0129 1.0256
dispcorr: -0.025178253 hartree
energy: -965.427904891927
dipole: 18.89290 -17.75182 1.14109 -8.89164 7.98578 -0.90586 0.46040 0.81349 1.27390
magnitude: 1.93532 au
magnitude: 4.91920 debye
