program: Orca
programVersion: 5.0.2
elementType: O O O C C C C C C C C C C C C C C C C C C C H H H H H H H H H H H H H H H H H H H H H H H H H H
charge: 0
multiplicity: 1
keywords: wb97x-d3
keywords: def2-TZVPP
keywords: def2/J RIJCOSX
keywords: DEFGRID2
keywords: scfconv7
keywords: smallprint printgap noloewdin
keywords: NOSOSCF
formula: C19H26O3
InChI: InChI=1/C19H26O3/c1-7-8-13-12(4)16(10-15(13)20)22-18(21)17-14(9-11(2)3)19(17,5)6/h7,9,14,16-17H,1,8,10H2,2-6H3
48 atoms
O  -0.402983 0.365475 1.7013
O  -0.157471 0.224407 -0.518924
O  -4.073171 2.498103 -0.444884
C  2.395037 -1.403242 0.334498
C  2.780098 -0.031821 -0.132029
C  1.708344 -0.182007 0.922863
C  3.324131 -2.149066 1.262068
C  1.664679 -2.312497 -0.622945
C  4.07143 0.592613 0.222922
C  0.308626 0.154242 0.587632
C  5.001727 1.024753 -0.630789
C  -1.792873 0.661511 1.592887
C  4.892336 0.932566 -2.122113
C  6.271907 1.648091 -0.134525
C  -2.156049 2.004175 0.963683
C  -2.595867 -0.357244 0.823361
C  -3.519657 0.225263 0.049559
C  -3.366113 1.68938 0.100335
C  -2.369842 -1.813267 1.009065
C  -4.538402 -0.442883 -0.817759
C  -3.906501 -1.010757 -2.053636
C  -3.967653 -2.283603 -2.419059
H  2.384502 0.225648 -1.108794
H  1.99192 0.051928 1.94338
H  2.780411 -2.919121 1.811873
H  4.114623 -2.640393 0.692323
H  3.804933 -1.500472 1.992831
H  1.033625 -3.022276 -0.08288
H  1.036925 -1.773212 -1.328103
H  2.388495 -2.892756 -1.198143
H  4.273522 0.706743 1.283965
H  -2.118477 0.636483 2.637002
H  3.961903 0.487152 -2.464795
H  5.710604 0.333168 -2.527984
H  4.977291 1.920903 -2.579359
H  7.145269 1.09239 -0.484843
H  6.313612 1.686409 0.953136
H  6.381776 2.668505 -0.50992
H  -1.360889 2.388851 0.324006
H  -2.387322 2.777817 1.695902
H  -2.060848 -2.04963 2.027678
H  -3.260842 -2.39235 0.772791
H  -1.580708 -2.159043 0.337508
H  -5.293046 0.297272 -1.097615
H  -5.057017 -1.233412 -0.268736
H  -3.356862 -0.30451 -2.667465
H  -3.488342 -2.63667 -3.321686
H  -4.501788 -3.022253 -1.833067
totalener: -965.40262654 hartree
nucrepener: 1821.00724233 hartree
electener: -2786.40986886 hartree
oneelecener: -4928.22801488 hartree
twoeener: 2141.81814601 hartree
kineticenergy: 961.05598272 hartree
xcener: -95.143049056342 hartree
chargesum: 0.0000000
charge: -0.273353 -0.381730 -0.333131 0.120998 0.027679 -0.116809 -0.237779 -0.286933 -0.194880 0.313574 -0.041583 0.246786 -0.236462 -0.205606 -0.143032 -0.018355 -0.070041 0.212359 -0.272737 -0.127847 -0.125180 -0.227279 0.094833 0.071747 0.090136 0.092053 0.072494 0.078677 0.107322 0.092737 0.075671 0.097504 0.083017 0.085669 0.087884 0.083817 0.076695 0.086491 0.100806 0.088226 0.108599 0.094749 0.116354 0.102368 0.085432 0.119016 0.102353 0.076690
qa: -0.2734 -0.3817 -0.3331 0.1210 0.0277 -0.1168 -0.2378 -0.2869 -0.1949 0.3136 -0.0416 0.2468 -0.2365 -0.2056 -0.1430 -0.0184 -0.0700 0.2124 -0.2727 -0.1278 -0.1252 -0.2273 0.0948 0.0717 0.0901 0.0921 0.0725 0.0787 0.1073 0.0927 0.0757 0.0975 0.0830 0.0857 0.0879 0.0838 0.0767 0.0865 0.1008 0.0882 0.1086 0.0947 0.1164 0.1024 0.0854 0.1190 0.1024 0.0767
va: 2.1294 2.1123 2.1684 3.6930 3.7905 3.9235 3.9097 3.9102 3.8939 4.2511 3.8048 3.8220 3.9481 3.9371 3.8377 3.6555 3.4423 4.1369 3.9478 3.9151 3.8321 3.9544 1.0335 1.0416 1.0047 1.0053 1.0107 1.0029 1.0174 1.0050 1.0196 0.9915 1.0143 0.9995 0.9994 0.9986 1.0121 0.9982 1.0306 1.0277 1.0055 1.0065 0.9964 1.0269 1.0056 1.0093 1.0105 1.0154
dispcorr: -0.023574504 hartree
energy: -965.426201041856
dipole: 22.25887 -20.96137 1.29750 -12.35378 11.20233 -1.15145 -4.19434 5.15022 0.95587
magnitude: 1.98067 au
magnitude: 5.03447 debye
