program: Orca
programVersion: 5.0.2
elementType: O O O C C C C C C C C C C C C C C C C C C C H H H H H H H H H H H H H H H H H H H H H H H H H H
charge: 0
multiplicity: 1
keywords: wb97x-d3
keywords: def2-TZVPP
keywords: def2/J RIJCOSX
keywords: DEFGRID2
keywords: scfconv7
keywords: smallprint printgap noloewdin
keywords: NOSOSCF
formula: C19H26O3
InChI: InChI=1/C19H26O3/c1-7-8-13-12(4)16(10-15(13)20)22-18(21)17-14(9-11(2)3)19(17,5)6/h7,9,14,16-17H,1,8,10H2,2-6H3
48 atoms
O  -0.450623 0.322508 1.745093
O  -0.244134 0.302398 -0.483162
O  -4.152332 2.493062 -0.282619
C  2.407554 -1.225673 0.235296
C  2.699207 0.185671 -0.172688
C  1.671962 -0.071794 0.899502
C  3.415877 -1.942354 1.099338
C  1.693259 -2.139388 -0.729377
C  3.972652 0.862913 0.180621
C  0.248421 0.202032 0.609609
C  5.067117 0.86329 -0.580889
C  -1.850247 0.58534 1.670654
C  5.149324 0.153714 -1.898168
C  6.308458 1.592757 -0.166232
C  -2.250459 1.956183 1.130534
C  -2.630935 -0.401152 0.83933
C  -3.556623 0.206979 0.087668
C  -3.438201 1.667372 0.227322
C  -2.380139 -1.862522 0.934986
C  -4.53223 -0.436961 -0.84492
C  -3.835355 -0.931879 -2.077843
C  -3.818784 -2.193228 -2.48552
H  2.265002 0.474994 -1.125897
H  1.967922 0.129927 1.923568
H  2.939991 -2.745121 1.665061
H  4.196433 -2.387258 0.479001
H  3.908053 -1.276767 1.807169
H  1.119819 -2.899682 -0.194031
H  1.013318 -1.61008 -1.392543
H  2.42423 -2.661683 -1.349908
H  3.998872 1.402381 1.123073
H  -2.163268 0.483768 2.713863
H  5.323194 0.862733 -2.711491
H  4.249642 -0.411719 -2.133263
H  5.991885 -0.541929 -1.909583
H  6.189131 2.092174 0.794401
H  6.585092 2.348851 -0.90512
H  7.157788 0.909537 -0.087724
H  -1.460071 2.412581 0.532963
H  -2.517581 2.668202 1.911767
H  -3.298509 -2.43479 0.807946
H  -1.700462 -2.175836 0.139173
H  -1.928511 -2.139729 1.887285
H  -5.292264 0.299405 -1.119208
H  -5.051309 -1.264378 -0.353263
H  -3.29818 -0.179994 -2.646791
H  -3.288187 -2.490702 -3.37955
H  -4.334439 -2.9774 -1.943822
totalener: -965.40157789 hartree
nucrepener: 1827.47941555 hartree
electener: -2792.88099343 hartree
oneelecener: -4941.23214116 hartree
twoeener: 2148.35114773 hartree
kineticenergy: 961.05464687 hartree
xcener: -95.141692256331 hartree
chargesum: -0.0000000
charge: -0.276603 -0.382581 -0.333584 0.113773 -0.036647 -0.111967 -0.241996 -0.292162 -0.190554 0.324699 -0.028625 0.252534 -0.233756 -0.211763 -0.145280 -0.009534 -0.075103 0.210723 -0.289438 -0.125352 -0.123298 -0.230581 0.110216 0.077809 0.092859 0.087961 0.082225 0.084082 0.108919 0.089074 0.089821 0.097960 0.096173 0.080467 0.084744 0.078795 0.087091 0.084443 0.099926 0.088533 0.099190 0.118812 0.109462 0.102329 0.086789 0.119015 0.103280 0.077120
qa: -0.2766 -0.3826 -0.3336 0.1138 -0.0366 -0.1120 -0.2420 -0.2922 -0.1906 0.3247 -0.0286 0.2525 -0.2338 -0.2118 -0.1453 -0.0095 -0.0751 0.2107 -0.2894 -0.1254 -0.1233 -0.2306 0.1102 0.0778 0.0929 0.0880 0.0822 0.0841 0.1089 0.0891 0.0898 0.0980 0.0962 0.0805 0.0847 0.0788 0.0871 0.0844 0.0999 0.0885 0.0992 0.1188 0.1095 0.1023 0.0868 0.1190 0.1033 0.0771
va: 2.1288 2.1147 2.1687 3.6805 3.8193 3.9069 3.9055 3.9040 3.8543 4.2580 3.7426 3.8108 3.9404 3.9408 3.8365 3.6401 3.4493 4.1390 3.9503 3.9113 3.8279 3.9543 1.0244 1.0380 1.0051 1.0040 1.0075 1.0028 1.0169 1.0058 1.0136 0.9908 1.0013 1.0113 1.0003 1.0107 0.9979 0.9988 1.0297 1.0271 1.0036 0.9933 1.0079 1.0281 1.0069 1.0092 1.0100 1.0152
dispcorr: -0.024421537 hartree
energy: -965.425999422075
dipole: 23.39767 -22.01211 1.38556 -13.23289 12.02151 -1.21138 -4.92509 5.81417 0.88908
magnitude: 2.04394 au
magnitude: 5.19527 debye
