program: Orca
programVersion: 5.0.2
elementType: O O O C C C C C C C C C C C C C C C C C C C H H H H H H H H H H H H H H H H H H H H H H H H H H
charge: 0
multiplicity: 1
keywords: wb97x-d3
keywords: def2-TZVPP
keywords: def2/J RIJCOSX
keywords: DEFGRID2
keywords: scfconv7
keywords: smallprint printgap noloewdin
keywords: NOSOSCF
formula: C19H26O3
InChI: InChI=1/C19H26O3/c1-7-8-13-12(4)16(10-15(13)20)22-18(21)17-14(9-11(2)3)19(17,5)6/h7,9,14,16-17H,1,8,10H2,2-6H3
48 atoms
O  -0.421575 0.088116 0.998664
O  0.427187 -1.976983 1.207315
O  -4.755469 1.565894 0.85409
C  3.033234 -0.400131 1.970701
C  3.110524 -0.847081 0.55149
C  1.884801 -0.089284 1.023093
C  3.845904 0.797899 2.401901
C  2.876119 -1.436243 3.056316
C  4.048106 -0.226536 -0.420108
C  0.586649 -0.788888 1.095387
C  3.76826 0.061499 -1.691861
C  -1.767103 -0.394174 1.033001
C  2.433902 -0.198433 -2.323191
C  4.790185 0.680041 -2.597325
C  -2.667495 0.645495 1.688258
C  -2.306882 -0.547013 -0.369655
C  -3.426041 0.164722 -0.557473
C  -3.770606 0.897552 0.675565
C  -1.624646 -1.418563 -1.359925
C  -4.249779 0.274797 -1.794207
C  -3.677139 1.180654 -2.848112
C  -2.512123 1.81178 -2.804749
H  2.930917 -1.910678 0.410367
H  1.81619 0.947708 0.715119
H  3.390504 1.276346 3.27039
H  4.856169 0.495531 2.684953
H  3.932974 1.548542 1.616606
H  2.328714 -2.314822 2.725678
H  3.861671 -1.764316 3.391866
H  2.356864 -1.020876 3.922044
H  5.049819 -0.017208 -0.054894
H  -1.797633 -1.353229 1.556275
H  1.930631 0.739615 -2.572768
H  1.769403 -0.778507 -1.686513
H  2.55335 -0.744474 -3.261674
H  5.728789 0.878758 -2.0818
H  4.426568 1.624049 -3.010787
H  5.004917 0.029925 -3.448827
H  -2.126949 1.575711 1.873088
H  -3.084169 0.319616 2.641448
H  -0.64467 -1.014042 -1.624021
H  -1.451211 -2.41449 -0.950128
H  -2.194753 -1.506347 -2.282457
H  -5.24468 0.639942 -1.523931
H  -4.41031 -0.715064 -2.234457
H  -4.308432 1.3108 -3.721856
H  -2.195605 2.446524 -3.620848
H  -1.837809 1.732892 -1.96129
totalener: -965.40543186 hartree
nucrepener: 1832.18260526 hartree
electener: -2797.58803712 hartree
oneelecener: -4950.32437789 hartree
twoeener: 2152.73634077 hartree
kineticenergy: 961.03967261 hartree
xcener: -95.139910148774 hartree
chargesum: 0.0000000
charge: -0.271158 -0.389332 -0.325695 0.126726 -0.012806 -0.121391 -0.271755 -0.261266 -0.247076 0.309692 -0.002047 0.250325 -0.213390 -0.212117 -0.152610 -0.105670 -0.070676 0.241479 -0.230901 -0.083956 -0.156480 -0.201961 0.107121 0.087914 0.092201 0.090758 0.086281 0.102892 0.084493 0.085733 0.094450 0.102418 0.096573 0.061093 0.093276 0.079442 0.085344 0.088587 0.090451 0.087129 0.092327 0.126645 0.097421 0.097924 0.086566 0.102792 0.100959 0.081274
qa: -0.2712 -0.3893 -0.3257 0.1267 -0.0128 -0.1214 -0.2718 -0.2613 -0.2471 0.3097 -0.0020 0.2503 -0.2134 -0.2121 -0.1526 -0.1057 -0.0707 0.2415 -0.2309 -0.0840 -0.1565 -0.2020 0.1071 0.0879 0.0922 0.0908 0.0863 0.1029 0.0845 0.0857 0.0944 0.1024 0.0966 0.0611 0.0933 0.0794 0.0853 0.0886 0.0905 0.0871 0.0923 0.1266 0.0974 0.0979 0.0866 0.1028 0.1010 0.0813
va: 2.1185 2.1041 2.1791 3.7314 3.8103 3.8329 3.9095 3.9040 3.9000 4.2287 3.7394 3.7217 3.9288 3.9439 3.8776 3.7238 3.4218 4.1002 3.9467 3.8564 3.8900 3.9299 1.0257 1.0321 1.0064 1.0016 1.0047 1.0206 1.0024 1.0019 1.0099 1.0280 0.9989 1.0182 1.0042 1.0097 0.9987 0.9986 1.0320 1.0286 1.0021 1.0071 1.0055 1.0248 0.9997 1.0090 1.0111 1.0258
dispcorr: -0.024254025 hartree
energy: -965.429685888082
dipole: 21.22070 -19.99783 1.22287 0.25982 -0.51016 -0.25034 -8.64245 8.07513 -0.56732
magnitude: 1.37111 au
magnitude: 3.48507 debye
