program: Orca
programVersion: 5.0.2
elementType: O O O C C C C C C C C C C C C C C C C C C C H H H H H H H H H H H H H H H H H H H H H H H H H H
charge: 0
multiplicity: 1
keywords: wb97x-d3
keywords: def2-TZVPP
keywords: def2/J RIJCOSX
keywords: DEFGRID2
keywords: scfconv7
keywords: smallprint printgap noloewdin
keywords: NOSOSCF
formula: C19H26O3
InChI: InChI=1/C19H26O3/c1-7-8-13-12(4)16(10-15(13)20)22-18(21)17-14(9-11(2)3)19(17,5)6/h7,9,14,16-17H,1,8,10H2,2-6H3
48 atoms
O  -0.550965 0.237671 0.713279
O  0.51029 -1.681463 1.180982
O  -5.00088 1.337994 0.886201
C  2.976874 0.234088 1.466175
C  3.015957 -0.440965 0.12983
C  1.755506 0.265898 0.560978
C  3.698357 1.549352 1.631005
C  2.992896 -0.615257 2.713123
C  3.801453 0.096181 -1.010501
C  0.540971 -0.522782 0.857418
C  5.073518 -0.211043 -1.266431
C  -1.836089 -0.325894 0.985652
C  5.881627 -1.134983 -0.407763
C  5.79157 0.351128 -2.455197
C  -2.74931 0.740634 1.576161
C  -2.513869 -0.755472 -0.294215
C  -3.71826 -0.186588 -0.437037
C  -3.984088 0.723787 0.693595
C  -1.85411 -1.72094 -1.210859
C  -4.704017 -0.334179 -1.550331
C  -4.452308 0.699356 -2.610738
C  -5.234439 1.743618 -2.843075
H  2.942068 -1.524365 0.177611
H  1.558543 1.227665 0.099334
H  4.754034 1.379124 1.851448
H  3.650924 2.169348 0.736671
H  3.271965 2.118662 2.458716
H  4.025739 -0.777832 3.02815
H  2.47642 -0.115662 3.535095
H  2.531401 -1.588873 2.569601
H  3.289544 0.777125 -1.684483
H  -1.721726 -1.184077 1.652992
H  6.194772 -2.016785 -0.97261
H  5.342296 -1.476203 0.473857
H  6.797282 -0.644316 -0.069065
H  5.161329 1.024671 -3.034564
H  6.13168 -0.445658 -3.121551
H  6.684024 0.902901 -2.150027
H  -2.284622 1.72732 1.527345
H  -3.01384 0.558931 2.618137
H  -0.987358 -1.265744 -1.695179
H  -1.484771 -2.590039 -0.665487
H  -2.525977 -2.063183 -1.996139
H  -5.713711 -0.218686 -1.152204
H  -4.641215 -1.335902 -1.983505
H  -3.542037 0.571778 -3.189227
H  -4.995505 2.47019 -3.607565
H  -6.137804 1.914042 -2.271199
totalener: -965.40567796 hartree
nucrepener: 1776.54440200 hartree
electener: -2741.95007996 hartree
oneelecener: -4839.17808976 hartree
twoeener: 2097.22800980 hartree
kineticenergy: 961.04953554 hartree
xcener: -95.138277940748 hartree
chargesum: 0.0000000
charge: -0.275263 -0.392588 -0.327150 0.096492 -0.036581 -0.109492 -0.241569 -0.273613 -0.185923 0.333125 -0.031068 0.234575 -0.234227 -0.210657 -0.140582 -0.077661 -0.032243 0.220420 -0.246417 -0.131152 -0.147078 -0.195262 0.108458 0.079465 0.087205 0.081502 0.094923 0.084269 0.089133 0.104881 0.089994 0.096815 0.095714 0.080878 0.085516 0.078502 0.086962 0.084738 0.089491 0.086668 0.100890 0.119684 0.091887 0.092594 0.099354 0.104430 0.099375 0.090588
qa: -0.2753 -0.3926 -0.3272 0.0965 -0.0366 -0.1095 -0.2416 -0.2736 -0.1859 0.3331 -0.0311 0.2346 -0.2342 -0.2107 -0.1406 -0.0777 -0.0322 0.2204 -0.2464 -0.1312 -0.1471 -0.1953 0.1085 0.0795 0.0872 0.0815 0.0949 0.0843 0.0891 0.1049 0.0900 0.0968 0.0957 0.0809 0.0855 0.0785 0.0870 0.0847 0.0895 0.0867 0.1009 0.1197 0.0919 0.0926 0.0994 0.1044 0.0994 0.0906
va: 2.1239 2.1047 2.1719 3.7131 3.8162 3.8973 3.9060 3.9060 3.8546 4.2474 3.7421 3.7479 3.9397 3.9404 3.8742 3.7609 3.4000 4.1309 3.9416 3.8853 3.8438 3.9793 1.0235 1.0380 1.0038 1.0074 1.0051 1.0019 1.0030 1.0204 1.0136 1.0289 1.0014 1.0112 1.0004 1.0107 0.9979 0.9992 1.0330 1.0279 0.9997 1.0084 1.0061 1.0295 1.0034 1.0086 1.0075 1.0193
dispcorr: -0.022628046 hartree
energy: -965.428306003999
dipole: 25.87857 -24.36672 1.51185 -0.36359 0.11189 -0.25170 -6.06393 5.61511 -0.44883
magnitude: 1.59703 au
magnitude: 4.05932 debye
