program: Orca
programVersion: 5.0.2
elementType: O O O C C C C C C C C C C C C C C C C C C C H H H H H H H H H H H H H H H H H H H H H H H H H H
charge: 0
multiplicity: 1
keywords: wb97x-d3
keywords: def2-TZVPP
keywords: def2/J RIJCOSX
keywords: DEFGRID2
keywords: scfconv7
keywords: smallprint printgap noloewdin
keywords: NOSOSCF
formula: C19H26O3
InChI: InChI=1/C19H26O3/c1-7-8-13-12(4)16(10-15(13)20)22-18(21)17-14(9-11(2)3)19(17,5)6/h7,9,14,16-17H,1,8,10H2,2-6H3
48 atoms
O  -0.40826 0.389035 1.668874
O  -0.160497 0.172586 -0.543021
O  -4.072568 2.332336 -0.637175
C  2.364435 -1.461938 0.407057
C  2.774934 -0.132016 -0.15102
C  1.701042 -0.190681 0.915535
C  3.271608 -2.168102 1.385951
C  1.613782 -2.416714 -0.488211
C  4.075752 0.488502 0.170898
C  0.306222 0.138269 0.570507
C  4.955528 0.995411 -0.699293
C  -1.802951 0.678582 1.564026
C  4.770669 1.028791 -2.185634
C  6.252433 1.578056 -0.222235
C  -2.181197 1.966087 0.838508
C  -2.617635 -0.401679 0.899526
C  -3.553735 0.116768 0.089098
C  -3.376528 1.569792 0.00026
C  -2.390098 -1.831465 1.215956
C  -4.623008 -0.603634 -0.658596
C  -4.207324 -1.146269 -1.994811
C  -2.993895 -1.090397 -2.528992
H  2.393862 0.060899 -1.148357
H  1.996098 0.104225 1.916773
H  2.710304 -2.905371 1.963332
H  4.064652 -2.699877 0.855703
H  3.744948 -1.490627 2.095448
H  2.323327 -3.073403 -0.995991
H  0.940837 -3.052853 0.091651
H  1.027569 -1.919022 -1.25765
H  4.33745 0.52321 1.224523
H  -2.111816 0.734543 2.610687
H  5.5381 0.426649 -2.679739
H  4.889132 2.046838 -2.565411
H  3.802019 0.66205 -2.519539
H  6.352198 1.532943 0.8624
H  6.350713 2.623823 -0.5261
H  7.103966 1.049567 -0.659821
H  -1.387382 2.339297 0.189579
H  -2.442095 2.774873 1.522028
H  -1.524617 -2.21167 0.666333
H  -2.18184 -1.977773 2.276961
H  -3.242517 -2.450774 0.9407
H  -5.476992 0.064731 -0.806658
H  -5.011572 -1.431266 -0.056684
H  -5.004511 -1.630844 -2.550984
H  -2.799905 -1.517519 -3.504829
H  -2.155234 -0.62036 -2.031328
elementType: O C H
totalener: -965.42713413 hartree
nucrepener: 1833.95596492 hartree
electener: -2799.38309905 hartree
oneelecener: -4954.62644876 hartree
twoeener: 2155.24334971 hartree
cpcmener: -0.03059298 hartree
kineticenergy: 960.99217780 hartree
xcener: -95.141906287557 hartree
chargesum: -0.0000000
charge: -0.296015 -0.471597 -0.451226 0.116873 0.040400 -0.098579 -0.270035 -0.290211 -0.279679 0.386170 -0.050574 0.300919 -0.250545 -0.217270 -0.157628 -0.019760 -0.134453 0.295110 -0.265387 -0.091691 -0.184352 -0.278201 0.093328 0.086050 0.096726 0.097489 0.088088 0.103010 0.094032 0.096466 0.117699 0.118709 0.096751 0.094393 0.089189 0.087152 0.093252 0.092116 0.112000 0.104409 0.115850 0.119032 0.108423 0.090858 0.103056 0.130609 0.127328 0.111719
qa: -0.2960 -0.4716 -0.4512 0.1169 0.0404 -0.0986 -0.2700 -0.2902 -0.2797 0.3862 -0.0506 0.3009 -0.2505 -0.2173 -0.1576 -0.0198 -0.1345 0.2951 -0.2654 -0.0917 -0.1844 -0.2782 0.0933 0.0861 0.0967 0.0975 0.0881 0.1030 0.0940 0.0965 0.1177 0.1187 0.0968 0.0944 0.0892 0.0872 0.0933 0.0921 0.1120 0.1044 0.1158 0.1190 0.1084 0.0909 0.1031 0.1306 0.1273 0.1117
va: 2.1369 2.0276 2.0547 3.6735 3.7805 3.8579 3.9068 3.9054 3.8688 4.1622 3.7634 3.7431 3.9413 3.9214 3.8656 3.6710 3.4465 4.0606 3.9414 3.8403 3.8444 3.8921 1.0334 1.0382 1.0024 1.0020 1.0064 1.0022 1.0000 1.0151 1.0105 0.9928 0.9969 0.9973 1.0108 1.0090 0.9966 0.9961 1.0282 1.0249 0.9942 1.0013 1.0023 1.0188 1.0009 1.0007 1.0056 1.0255
dispcorr: -0.024237961 hartree
energy: -965.451372089665
dipole: 22.48362 -20.98238 1.50124 -11.21377 9.50624 -1.70753 -3.28013 5.16623 1.88609
magnitude: 2.95411 au
magnitude: 7.50874 debye
