program: Orca
programVersion: 5.0.2
elementType: O O O C C C C C C C C C C C C C C C C C C C H H H H H H H H H H H H H H H H H H H H H H H H H H
charge: 0
multiplicity: 1
keywords: wb97x-d3
keywords: def2-TZVPP
keywords: def2/J RIJCOSX
keywords: DEFGRID2
keywords: scfconv7
keywords: smallprint printgap noloewdin
keywords: NOSOSCF
formula: C19H26O3
InChI: InChI=1/C19H26O3/c1-7-8-13-12(4)16(10-15(13)20)22-18(21)17-14(9-11(2)3)19(17,5)6/h7,9,14,16-17H,1,8,10H2,2-6H3
48 atoms
O  -0.578809 0.150862 0.824141
O  0.514559 -1.798387 0.993369
O  -5.050163 1.148901 1.100791
C  2.897209 0.178772 1.650851
C  3.038052 -0.378188 0.265714
C  1.723921 0.245358 0.687398
C  3.547671 1.499286 1.984852
C  2.880252 -0.781576 2.813972
C  3.839549 0.288186 -0.782705
C  0.525999 -0.598699 0.852849
C  4.843946 -0.256582 -1.476314
C  -1.863906 -0.464975 0.958975
C  5.34603 -1.656723 -1.292018
C  5.55744 0.527694 -2.536325
C  -2.804959 0.462341 1.714586
C  -2.502784 -0.649318 -0.396026
C  -3.723936 -0.095091 -0.450013
C  -4.014974 0.584238 0.818133
C  -1.800509 -1.384311 -1.474614
C  -4.680072 -0.080888 -1.591718
C  -4.498574 1.072735 -2.535617
C  -3.541264 1.990918 -2.48833
H  3.017514 -1.4623 0.224166
H  1.518331 1.236952 0.298494
H  3.07452 1.949281 2.85995
H  4.604797 1.35595 2.218821
H  3.484886 2.221396 1.171479
H  2.263476 -0.399721 3.630602
H  2.513597 -1.771382 2.550573
H  3.894079 -0.903919 3.200761
H  3.573851 1.317883 -1.004749
H  -1.76333 -1.430369 1.460045
H  4.916402 -2.169066 -0.433212
H  6.431479 -1.658944 -1.165164
H  5.141133 -2.262706 -2.178928
H  6.620936 0.628697 -2.303296
H  5.143744 1.528811 -2.65902
H  5.501982 0.02096 -3.503823
H  -2.362275 1.451057 1.857476
H  -3.08284 0.085308 2.699305
H  -2.420703 -1.505028 -2.360872
H  -0.894344 -0.853728 -1.777506
H  -1.487687 -2.373426 -1.134311
H  -5.705473 -0.058052 -1.209924
H  -4.608597 -1.011693 -2.162327
H  -5.238802 1.12725 -3.328363
H  -3.49656 2.781391 -3.226677
H  -2.769713 1.996128 -1.727362
elementType: O C H
totalener: -965.42988897 hartree
nucrepener: 1788.22569987 hartree
electener: -2753.65558884 hartree
oneelecener: -4862.61781338 hartree
twoeener: 2108.96222454 hartree
cpcmener: -0.02939436 hartree
kineticenergy: 960.98660978 hartree
xcener: -95.137508716794 hartree
chargesum: 0.0000000
charge: -0.291496 -0.469190 -0.446076 0.121351 0.039871 -0.124744 -0.265195 -0.282030 -0.286375 0.388955 -0.034087 0.271291 -0.256303 -0.222016 -0.140199 -0.046446 -0.103034 0.294969 -0.244716 -0.073409 -0.186456 -0.271393 0.092196 0.087924 0.097287 0.097169 0.087825 0.098972 0.092288 0.096464 0.117401 0.106106 0.091458 0.093360 0.098776 0.093715 0.087878 0.092893 0.099687 0.099342 0.102575 0.112145 0.119557 0.092664 0.101796 0.130106 0.130454 0.106691
qa: -0.2915 -0.4692 -0.4461 0.1214 0.0399 -0.1247 -0.2652 -0.2820 -0.2864 0.3890 -0.0341 0.2713 -0.2563 -0.2220 -0.1402 -0.0464 -0.1030 0.2950 -0.2447 -0.0734 -0.1865 -0.2714 0.0922 0.0879 0.0973 0.0972 0.0878 0.0990 0.0923 0.0965 0.1174 0.1061 0.0915 0.0934 0.0988 0.0937 0.0879 0.0929 0.0997 0.0993 0.1026 0.1121 0.1196 0.0927 0.1018 0.1301 0.1305 0.1067
va: 2.1278 2.0357 2.0592 3.6911 3.7595 3.8839 3.9063 3.9071 3.8803 4.1887 3.7354 3.7102 3.9446 3.9249 3.8975 3.7494 3.4458 4.0575 3.9337 3.8311 3.8454 3.9017 1.0326 1.0393 1.0026 1.0025 1.0050 0.9994 1.0187 1.0005 1.0102 1.0308 1.0078 0.9980 0.9962 0.9966 1.0090 0.9954 1.0297 1.0242 1.0046 0.9986 1.0051 1.0183 1.0001 1.0030 1.0043 1.0205
dispcorr: -0.022452461 hartree
energy: -965.452341428357
dipole: 25.78490 -23.94552 1.83938 0.01244 -0.35712 -0.34468 -7.40686 6.64502 -0.76185
magnitude: 2.02053 au
magnitude: 5.13578 debye
