program: Orca
programVersion: 5.0.2
elementType: O O O C C C C C C C C C C C C C C C C C C C H H H H H H H H H H H H H H H H H H H H H H H H H H
charge: 0
multiplicity: 1
keywords: wb97x-d3
keywords: def2-TZVPP
keywords: def2/J RIJCOSX
keywords: DEFGRID2
keywords: scfconv7
keywords: smallprint printgap noloewdin
keywords: NOSOSCF
formula: C19H26O3
InChI: InChI=1/C19H26O3/c1-7-8-13-12(4)16(10-15(13)20)22-18(21)17-14(9-11(2)3)19(17,5)6/h7,9,14,16-17H,1,8,10H2,2-6H3
48 atoms
O  -0.329701 0.074356 0.938645
O  0.559356 -1.95424 1.273997
O  -4.669084 1.492632 0.627481
C  3.089602 -0.251071 2.049578
C  3.242208 -0.796415 0.671499
C  1.976923 -0.042077 1.029509
C  3.847441 0.998658 2.429433
C  2.904478 -1.204278 3.204054
C  4.202326 -0.218781 -0.305766
C  0.696076 -0.766064 1.099362
C  3.956087 -0.012506 -1.602099
C  -1.67066 -0.426129 0.96737
C  2.646096 -0.330707 -2.256001
C  4.993401 0.574383 -2.510509
C  -2.597998 0.629855 1.55285
C  -2.1779 -0.659551 -0.436751
C  -3.316657 0.011529 -0.670591
C  -3.674996 0.808717 0.50945
C  -1.454223 -1.560176 -1.366583
C  -4.138595 0.060003 -1.918457
C  -3.723842 1.226192 -2.768166
C  -4.472816 2.295334 -3.00582
H  3.100509 -1.872942 0.599826
H  1.898642 0.968807 0.64542
H  4.856249 0.750921 2.766799
H  3.937852 1.702495 1.60188
H  3.346431 1.517059 3.249366
H  2.454239 -2.15069 2.913155
H  3.875339 -1.431544 3.649375
H  2.283223 -0.761297 3.985288
H  5.187319 0.034188 0.078083
H  -1.70829 -1.355829 1.539392
H  2.804667 -0.904232 -3.172672
H  2.126449 0.58493 -2.552684
H  1.975114 -0.905183 -1.619782
H  4.623352 1.485187 -2.989281
H  5.245651 -0.117077 -3.31873
H  5.91327 0.823157 -1.981132
H  -2.08068 1.579708 1.706691
H  -3.029726 0.336839 2.510515
H  -1.30071 -2.542406 -0.915934
H  -1.98643 -1.693956 -2.306569
H  -0.463551 -1.163643 -1.603966
H  -5.196318 0.142621 -1.658853
H  -4.019609 -0.868372 -2.481921
H  -2.723264 1.170498 -3.188197
H  -4.1097 3.111967 -3.61718
H  -5.471816 2.398291 -2.597798
elementType: O C H
totalener: -965.42799223 hartree
nucrepener: 1811.96930063 hartree
electener: -2777.39729286 hartree
oneelecener: -4910.00744574 hartree
twoeener: 2132.61015289 hartree
cpcmener: -0.02863184 hartree
kineticenergy: 960.98606082 hartree
xcener: -95.135259426157 hartree
chargesum: -0.0000000
charge: -0.287847 -0.470705 -0.446925 0.143279 -0.003718 -0.115218 -0.284764 -0.283107 -0.306578 0.373364 -0.009352 0.256646 -0.229834 -0.229368 -0.139784 -0.043177 -0.066959 0.280903 -0.256436 -0.102322 -0.180537 -0.273457 0.103832 0.094304 0.098531 0.093378 0.097270 0.093183 0.095217 0.099461 0.121054 0.105312 0.101659 0.104470 0.070391 0.094449 0.096696 0.089126 0.100064 0.100505 0.117906 0.105487 0.110919 0.092907 0.110006 0.139381 0.128696 0.111692
qa: -0.2878 -0.4707 -0.4469 0.1433 -0.0037 -0.1152 -0.2848 -0.2831 -0.3066 0.3734 -0.0094 0.2566 -0.2298 -0.2294 -0.1398 -0.0432 -0.0670 0.2809 -0.2564 -0.1023 -0.1805 -0.2735 0.1038 0.0943 0.0985 0.0934 0.0973 0.0932 0.0952 0.0995 0.1211 0.1053 0.1017 0.1045 0.0704 0.0944 0.0967 0.0891 0.1001 0.1005 0.1179 0.1055 0.1109 0.0929 0.1100 0.1394 0.1287 0.1117
va: 2.1237 2.0305 2.0540 3.6978 3.7985 3.8229 3.9067 3.8961 3.8944 4.1797 3.7133 3.7460 3.9246 3.9325 3.9051 3.7530 3.4375 4.0809 3.9369 3.8595 3.7940 3.9506 1.0263 1.0308 1.0002 1.0023 1.0032 1.0186 1.0012 0.9988 1.0041 1.0293 1.0014 0.9969 1.0126 0.9964 0.9962 1.0063 1.0307 1.0237 1.0055 1.0068 0.9967 1.0232 1.0055 1.0011 1.0028 1.0137
dispcorr: -0.023488472 hartree
energy: -965.451480698733
dipole: 19.92644 -18.12283 1.80360 0.88714 -1.25970 -0.37256 -7.90404 7.24131 -0.66273
magnitude: 1.95729 au
magnitude: 4.97505 debye
