program: Orca
programVersion: 5.0.2
elementType: O O O C C C C C C C C C C C C C C C C C C C H H H H H H H H H H H H H H H H H H H H H H H H H H
charge: 0
multiplicity: 1
keywords: wb97x-d3
keywords: def2-TZVPP
keywords: def2/J RIJCOSX
keywords: DEFGRID2
keywords: scfconv7
keywords: smallprint printgap noloewdin
keywords: NOSOSCF
formula: C19H26O3
InChI: InChI=1/C19H26O3/c1-7-8-13-12(4)16(10-15(13)20)22-18(21)17-14(9-11(2)3)19(17,5)6/h7,9,14,16-17H,1,8,10H2,2-6H3
48 atoms
O  -0.571198 0.107488 1.016205
O  0.454447 -1.884247 0.979883
O  -5.083137 1.080333 1.10288
C  2.96262 -0.202385 1.816597
C  2.992487 -0.418443 0.335191
C  1.736429 0.138914 0.989547
C  3.688708 0.979063 2.415154
C  2.980564 -1.414107 2.71573
C  3.772574 0.426697 -0.585966
C  0.510351 -0.677638 0.998814
C  4.455092 -0.023646 -1.643233
C  -1.874531 -0.481056 0.978168
C  4.499604 -1.477564 -2.034859
C  5.248389 0.9102 -2.504609
C  -2.85649 0.376265 1.762707
C  -2.412801 -0.494364 -0.431197
C  -3.631048 0.064908 -0.504308
C  -4.017446 0.577616 0.815918
C  -1.638674 -1.096924 -1.542678
C  -4.50297 0.193903 -1.706607
C  -4.126596 1.301822 -2.648258
C  -3.098883 2.133326 -2.529899
H  2.905621 -1.460508 0.044516
H  1.562518 1.200558 0.853427
H  3.288359 1.207391 3.404926
H  4.751686 0.758409 2.532458
H  3.602066 1.883642 1.81446
H  2.425735 -1.230399 3.638423
H  2.56971 -2.304893 2.246229
H  4.011824 -1.64085 2.995129
H  3.791768 1.491953 -0.376696
H  -1.834312 -1.499929 1.370362
H  3.503841 -1.915861 -2.121472
H  5.051282 -2.078514 -1.308277
H  4.993851 -1.6112 -2.997356
H  6.303798 0.623924 -2.52251
H  5.187156 1.942889 -2.160518
H  4.904595 0.878338 -3.542154
H  -2.424879 1.351472 2.002381
H  -3.180086 -0.077637 2.699512
H  -2.209919 -1.128862 -2.468696
H  -0.728901 -0.522774 -1.737756
H  -1.323949 -2.112626 -1.295927
H  -5.5400 0.343754 -1.391145
H  -4.510898 -0.74565 -2.268206
H  -4.782432 1.399746 -3.508429
H  -2.915501 2.89474 -3.277584
H  -2.403293 2.093693 -1.699983
elementType: O C H
totalener: -965.42836511 hartree
nucrepener: 1796.75650144 hartree
electener: -2762.18486655 hartree
oneelecener: -4879.63882233 hartree
twoeener: 2117.45395578 hartree
cpcmener: -0.02837643 hartree
kineticenergy: 960.98342940 hartree
xcener: -95.137403839522 hartree
chargesum: 0.0000000
charge: -0.293508 -0.471083 -0.447604 0.101180 0.044458 -0.098024 -0.275145 -0.277348 -0.297238 0.384518 -0.010391 0.276225 -0.286082 -0.221809 -0.144674 -0.064337 -0.088173 0.300616 -0.250192 -0.070688 -0.189312 -0.272849 0.094471 0.087085 0.097502 0.097921 0.088237 0.097146 0.092608 0.094872 0.115323 0.104663 0.100248 0.107762 0.095375 0.098010 0.084314 0.095088 0.100795 0.098232 0.103689 0.114829 0.121466 0.089943 0.102785 0.130870 0.129450 0.108776
qa: -0.2935 -0.4711 -0.4476 0.1012 0.0445 -0.0980 -0.2751 -0.2773 -0.2972 0.3845 -0.0104 0.2762 -0.2861 -0.2218 -0.1447 -0.0643 -0.0882 0.3006 -0.2502 -0.0707 -0.1893 -0.2728 0.0945 0.0871 0.0975 0.0979 0.0882 0.0971 0.0926 0.0949 0.1153 0.1047 0.1002 0.1078 0.0954 0.0980 0.0843 0.0951 0.1008 0.0982 0.1037 0.1148 0.1215 0.0899 0.1028 0.1309 0.1294 0.1088
va: 2.1282 2.0318 2.0592 3.7055 3.7742 3.8639 3.9151 3.9045 3.9072 4.1828 3.6979 3.7203 3.9395 3.9207 3.9035 3.7457 3.4278 4.0463 3.9304 3.8343 3.8443 3.9015 1.0267 1.0367 1.0016 1.0012 1.0069 0.9997 1.0200 1.0000 1.0113 1.0303 0.9985 0.9942 1.0041 0.9926 1.0104 0.9934 1.0285 1.0252 1.0038 0.9961 1.0077 1.0236 0.9985 1.0026 1.0048 1.0188
dispcorr: -0.022536670 hartree
energy: -965.450901781479
dipole: 25.22744 -23.31338 1.91406 -0.12455 -0.13626 -0.26081 -8.52870 7.74423 -0.78448
magnitude: 2.08496 au
magnitude: 5.29954 debye
