program: Orca
programVersion: 5.0.2
elementType: O O O C C C C C C C C C C C C C C C C C C C H H H H H H H H H H H H H H H H H H H H H H H H H H
charge: 0
multiplicity: 1
keywords: wb97x-d3
keywords: def2-TZVPP
keywords: def2/J RIJCOSX
keywords: DEFGRID2
keywords: scfconv7
keywords: smallprint printgap noloewdin
keywords: NOSOSCF
formula: C19H26O3
InChI: InChI=1/C19H26O3/c1-7-8-13-12(4)16(10-15(13)20)22-18(21)17-14(9-11(2)3)19(17,5)6/h7,9,14,16-17H,1,8,10H2,2-6H3
48 atoms
O  -0.167213 0.354349 1.527835
O  -0.085847 -0.078171 -0.66608
O  -3.578422 2.57399 -0.861017
C  2.411571 -1.792323 0.267464
C  2.84145 -0.546692 -0.42522
C  1.83815 -0.450968 0.708319
C  3.344904 -2.441031 1.261363
C  1.55217 -2.785172 -0.475622
C  4.198886 0.036446 -0.26663
C  0.450744 -0.054625 0.416481
C  4.481418 1.337166 -0.376527
C  -1.521882 0.801675 1.463469
C  3.443739 2.383401 -0.644475
C  5.880869 1.84969 -0.226487
C  -1.767931 2.087554 0.679918
C  -2.477644 -0.205133 0.878269
C  -3.342646 0.368979 0.027593
C  -2.989525 1.779474 -0.157404
C  -2.42971 -1.630102 1.285334
C  -4.454572 -0.296405 -0.720352
C  -3.919752 -1.048786 -1.903097
C  -4.013704 -2.362717 -2.065489
H  2.392217 -0.405243 -1.405667
H  2.217028 -0.089276 1.657556
H  2.782376 -3.045873 1.975189
H  4.049058 -3.104074 0.753965
H  3.924221 -1.715342 1.832495
H  0.89761 -3.329083 0.208952
H  0.931896 -2.32757 -1.243679
H  2.189468 -3.521398 -0.970223
H  5.013487 -0.65574 -0.072009
H  -1.776619 0.944476 2.516289
H  3.379163 3.084787 0.192147
H  2.448685 1.97418 -0.812158
H  3.711363 2.977872 -1.521837
H  6.591061 1.051817 -0.008921
H  5.943946 2.586278 0.579057
H  6.212986 2.358869 -1.135224
H  -0.934749 2.360897 0.029848
H  -1.957331 2.94328 1.329634
H  -3.40434 -2.109301 1.197702
H  -1.740203 -2.186122 0.64343
H  -2.078849 -1.74498 2.311449
H  -5.164855 0.463847 -1.057245
H  -5.003291 -0.975925 -0.064136
H  -3.408662 -0.452797 -2.653895
H  -3.596956 -2.854724 -2.935352
H  -4.509995 -2.996348 -1.338908
elementType: O C H
totalener: -965.42529459 hartree
nucrepener: 1845.36208193 hartree
electener: -2810.78737652 hartree
oneelecener: -4977.44930036 hartree
twoeener: 2166.66192384 hartree
cpcmener: -0.02974029 hartree
kineticenergy: 960.99466209 hartree
xcener: -95.138764228763 hartree
chargesum: 0.0000000
charge: -0.295158 -0.467998 -0.455772 0.163099 -0.033678 -0.108112 -0.291880 -0.285733 -0.292530 0.382148 -0.010235 0.284928 -0.240455 -0.227955 -0.152513 -0.000994 -0.115552 0.281539 -0.284938 -0.103570 -0.174263 -0.286223 0.104193 0.089158 0.097236 0.100089 0.092074 0.095757 0.094933 0.099931 0.122657 0.116870 0.098583 0.077643 0.099946 0.088849 0.093495 0.095860 0.111746 0.107410 0.111426 0.117525 0.119250 0.093928 0.104027 0.142532 0.129240 0.111485
qa: -0.2952 -0.4680 -0.4558 0.1631 -0.0337 -0.1081 -0.2919 -0.2857 -0.2925 0.3821 -0.0102 0.2849 -0.2405 -0.2280 -0.1525 -0.0010 -0.1156 0.2815 -0.2849 -0.1036 -0.1743 -0.2862 0.1042 0.0892 0.0972 0.1001 0.0921 0.0958 0.0949 0.0999 0.1227 0.1169 0.0986 0.0776 0.0999 0.0888 0.0935 0.0959 0.1117 0.1074 0.1114 0.1175 0.1193 0.0939 0.1040 0.1425 0.1292 0.1115
va: 2.1282 2.0364 2.0476 3.6906 3.8303 3.8158 3.9091 3.8881 3.8869 4.1667 3.7050 3.7731 3.9391 3.9306 3.8613 3.6554 3.4614 4.0770 3.9396 3.8705 3.7896 3.9401 1.0261 1.0343 1.0029 0.9992 1.0018 0.9999 1.0172 1.0028 1.0034 0.9912 0.9979 1.0170 1.0000 1.0063 0.9964 0.9963 1.0244 1.0226 0.9995 0.9934 1.0055 1.0254 1.0071 1.0023 1.0039 1.0098
dispcorr: -0.024464990 hartree
energy: -965.449759582889
dipole: 17.84491 -16.41991 1.42500 -9.98521 8.66106 -1.32415 0.27136 1.78243 2.05379
magnitude: 2.82879 au
magnitude: 7.19020 debye
