program: Orca
programVersion: 5.0.2
elementType: O O O C C C C C C C C C C C C C C C C C C C H H H H H H H H H H H H H H H H H H H H H H H H H H
charge: 0
multiplicity: 1
keywords: wb97x-d3
keywords: def2-TZVPP
keywords: def2/J RIJCOSX
keywords: DEFGRID2
keywords: scfconv7
keywords: smallprint printgap noloewdin
keywords: NOSOSCF
formula: C19H26O3
InChI: InChI=1/C19H26O3/c1-7-8-13-12(4)16(10-15(13)20)22-18(21)17-14(9-11(2)3)19(17,5)6/h7,9,14,16-17H,1,8,10H2,2-6H3
48 atoms
O  -0.428571 0.062637 0.939567
O  0.571363 -1.816883 0.239364
O  -4.945594 0.916729 1.464262
C  3.002431 -0.562856 1.809048
C  3.184373 -0.382544 0.333596
C  1.879918 0.044445 0.983563
C  3.691229 0.380366 2.765959
C  2.886928 -1.965611 2.352948
C  4.067835 0.642675 -0.255186
C  0.640872 -0.691962 0.674274
C  4.892424 0.452609 -1.29014
C  -1.741931 -0.446769 0.691938
C  5.041905 -0.857775 -2.010947
C  5.719775 1.577164 -1.835033
C  -2.704284 0.033902 1.767783
C  -2.292305 0.108469 -0.599331
C  -3.4996 0.668829 -0.422562
C  -3.876099 0.590275 0.994263
C  -1.54661 -0.049985 -1.870312
C  -4.412559 1.239741 -1.463128
C  -5.172846 0.159442 -2.173926
C  -5.146695 -0.040389 -3.4858
H  3.102924 -1.303683 -0.23348
H  1.741302 1.110432 1.126767
H  4.728687 0.076905 2.921531
H  3.696576 1.412817 2.418431
H  3.194395 0.366562 3.738068
H  2.493944 -2.678005 1.630947
H  3.874531 -2.320882 2.654195
H  2.246961 -1.993306 3.237581
H  4.022075 1.63424 0.185743
H  -1.715477 -1.537771 0.641355
H  4.896527 -1.723109 -1.365289
H  6.034886 -0.94622 -2.454457
H  4.324678 -0.939597 -2.832529
H  5.528886 2.519757 -1.321629
H  5.522045 1.728158 -2.900131
H  6.787432 1.356874 -1.750429
H  -2.26196 0.838299 2.361211
H  -3.014128 -0.750906 2.457852
H  -0.558249 0.411448 -1.808148
H  -1.385981 -1.108242 -2.089275
H  -2.069986 0.394692 -2.714241
H  -3.848179 1.835328 -2.183561
H  -5.117908 1.919736 -0.976682
H  -5.775294 -0.490969 -1.545783
H  -5.711256 -0.841203 -3.946626
H  -4.555314 0.582774 -4.147616
elementType: O C H
totalener: -965.42923829 hartree
nucrepener: 1771.22208750 hartree
electener: -2736.65132579 hartree
oneelecener: -4828.51200346 hartree
twoeener: 2091.86067766 hartree
cpcmener: -0.02811220 hartree
kineticenergy: 960.98131930 hartree
xcener: -95.134946065416 hartree
chargesum: -0.0000000
charge: -0.290590 -0.470177 -0.451542 0.103732 0.050278 -0.108535 -0.269958 -0.277077 -0.297236 0.387415 -0.017806 0.253795 -0.280964 -0.219333 -0.137694 -0.062887 -0.061266 0.300144 -0.238187 -0.103605 -0.180083 -0.282424 0.091649 0.086055 0.097654 0.087470 0.097224 0.091954 0.095931 0.098145 0.115829 0.105158 0.097740 0.095095 0.107018 0.085915 0.096169 0.093146 0.101224 0.096863 0.114068 0.117276 0.096714 0.103635 0.098430 0.142119 0.129600 0.111921
qa: -0.2906 -0.4702 -0.4515 0.1037 0.0503 -0.1085 -0.2700 -0.2771 -0.2972 0.3874 -0.0178 0.2538 -0.2810 -0.2193 -0.1377 -0.0629 -0.0613 0.3001 -0.2382 -0.1036 -0.1801 -0.2824 0.0916 0.0861 0.0977 0.0875 0.0972 0.0920 0.0959 0.0981 0.1158 0.1052 0.0977 0.0951 0.1070 0.0859 0.0962 0.0931 0.1012 0.0969 0.1141 0.1173 0.0967 0.1036 0.0984 0.1421 0.1296 0.1119
va: 2.1233 2.0346 2.0496 3.6989 3.7640 3.8651 3.9120 3.9072 3.9065 4.1900 3.7196 3.7446 3.9430 3.9256 3.9218 3.7921 3.4196 4.0619 3.9329 3.8646 3.7972 3.9429 1.0321 1.0384 1.0016 1.0063 1.0019 1.0191 1.0001 0.9995 1.0116 1.0313 1.0013 1.0004 0.9936 1.0098 0.9938 0.9951 1.0276 1.0254 1.0032 1.0020 1.0069 1.0035 1.0230 1.0046 1.0038 1.0096
dispcorr: -0.021839430 hartree
energy: -965.451077724123
dipole: 24.09004 -22.06572 2.02432 -0.18515 0.45789 0.27274 -8.05595 7.40019 -0.65576
magnitude: 2.14529 au
magnitude: 5.45290 debye
