program: Orca
programVersion: 5.0.2
elementType: O O O C C C C C C C C C C C C C C C C C C C H H H H H H H H H H H H H H H H H H H H H H H H H H
charge: 0
multiplicity: 1
keywords: wb97x-d3
keywords: def2-TZVPP
keywords: def2/J RIJCOSX
keywords: DEFGRID2
keywords: scfconv7
keywords: smallprint printgap noloewdin
keywords: NOSOSCF
formula: C19H26O3
InChI: InChI=1/C19H26O3/c1-7-8-13-12(4)16(10-15(13)20)22-18(21)17-14(9-11(2)3)19(17,5)6/h7,9,14,16-17H,1,8,10H2,2-6H3
48 atoms
O  -0.535721 0.159899 0.965246
O  0.502192 -1.826286 0.934446
O  -5.049053 1.088581 1.324001
C  2.975917 -0.098765 1.782894
C  3.047317 -0.36676 0.310674
C  1.771963 0.20359 0.906553
C  3.686495 1.105635 2.353353
C  2.968015 -1.275962 2.727035
C  3.845711 0.459451 -0.615054
C  0.549579 -0.619246 0.937662
C  4.684227 -0.023012 -1.536715
C  -1.8372 -0.434014 1.001798
C  4.917067 -1.497719 -1.73906
C  5.449854 0.892032 -2.442281
C  -2.775743 0.41629 1.845182
C  -2.457657 -0.450189 -0.373332
C  -3.683223 0.098283 -0.371017
C  -3.99504 0.60299 0.971907
C  -1.747691 -1.05924 -1.523371
C  -4.628108 0.229854 -1.524995
C  -4.214715 1.334571 -2.452422
C  -3.929439 1.170131 -3.738327
H  2.979328 -1.418689 0.051107
H  1.594712 1.258924 0.728718
H  4.747256 0.890556 2.498755
H  3.611631 1.987076 1.71766
H  3.267357 1.368697 3.326612
H  3.989257 -1.481143 3.057703
H  2.373029 -1.06407 3.619438
H  2.584691 -2.187962 2.273578
H  3.731622 1.536323 -0.532724
H  -1.769375 -1.453523 1.388352
H  4.032453 -1.998901 -2.140025
H  5.179106 -2.007802 -0.810386
H  5.729009 -1.675743 -2.444503
H  5.223243 1.942056 -2.256399
H  5.229494 0.680179 -3.492263
H  6.527602 0.752248 -2.321181
H  -2.339576 1.39626 2.055258
H  -3.035959 -0.03893 2.80088
H  -0.875686 -0.459803 -1.803153
H  -1.378426 -2.055709 -1.27043
H  -2.385105 -1.141144 -2.402092
H  -5.62997 0.435753 -1.136876
H  -4.691663 -0.712186 -2.074188
H  -4.145487 2.325567 -2.011489
H  -3.632136 2.004495 -4.361644
H  -3.984475 0.199404 -4.21874
elementType: O C H
totalener: -965.42817481 hartree
nucrepener: 1778.71559226 hartree
electener: -2744.14376706 hartree
oneelecener: -4843.53540032 hartree
twoeener: 2099.39163325 hartree
cpcmener: -0.02760144 hartree
kineticenergy: 960.97067525 hartree
xcener: -95.132441481311 hartree
chargesum: -0.0000000
charge: -0.291395 -0.470937 -0.449619 0.110023 0.048181 -0.115210 -0.270306 -0.281822 -0.302898 0.392496 -0.007624 0.255603 -0.285536 -0.221987 -0.136048 -0.049885 -0.071953 0.290128 -0.249843 -0.089388 -0.185153 -0.281003 0.095012 0.086085 0.097393 0.087322 0.097627 0.095218 0.098273 0.093172 0.116195 0.102465 0.103942 0.103340 0.094856 0.084286 0.097958 0.095481 0.100365 0.097940 0.116546 0.118067 0.099068 0.094427 0.103909 0.143023 0.129423 0.112786
qa: -0.2914 -0.4709 -0.4496 0.1100 0.0482 -0.1152 -0.2703 -0.2818 -0.3029 0.3925 -0.0076 0.2556 -0.2855 -0.2220 -0.1360 -0.0499 -0.0720 0.2901 -0.2498 -0.0894 -0.1852 -0.2810 0.0950 0.0861 0.0974 0.0873 0.0976 0.0952 0.0983 0.0932 0.1162 0.1025 0.1039 0.1033 0.0949 0.0843 0.0980 0.0955 0.1004 0.0979 0.1165 0.1181 0.0991 0.0944 0.1039 0.1430 0.1294 0.1128
va: 2.1271 2.0323 2.0545 3.6889 3.7638 3.8876 3.9138 3.9067 3.8976 4.1760 3.6906 3.7417 3.9411 3.9217 3.9063 3.7674 3.4409 4.0646 3.9294 3.8506 3.8017 3.9379 1.0269 1.0389 1.0017 1.0062 1.0019 1.0003 0.9991 1.0194 1.0105 1.0307 0.9959 0.9958 1.0047 1.0103 0.9926 0.9932 1.0287 1.0249 0.9984 1.0093 1.0062 1.0268 1.0047 1.0024 1.0040 1.0094
dispcorr: -0.021984710 hartree
energy: -965.450159516860
dipole: 25.07780 -23.11804 1.95976 -0.71574 0.58798 -0.12777 -9.10282 8.39055 -0.71227
magnitude: 2.08910 au
magnitude: 5.31006 debye
