program: Orca
programVersion: 5.0.2
elementType: O O O C C C C C C C C C C C C C C C C C C C H H H H H H H H H H H H H H H H H H H H H H H H H H
charge: 0
multiplicity: 1
keywords: wb97x-d3
keywords: def2-TZVPP
keywords: def2/J RIJCOSX
keywords: DEFGRID2
keywords: scfconv7
keywords: smallprint printgap noloewdin
keywords: NOSOSCF
formula: C19H26O3
InChI: InChI=1/C19H26O3/c1-7-8-13-12(4)16(10-15(13)20)22-18(21)17-14(9-11(2)3)19(17,5)6/h7,9,14,16-17H,1,8,10H2,2-6H3
48 atoms
O  -0.434405 0.058926 1.004335
O  0.546342 -1.820681 0.279375
O  -4.952848 0.961566 1.444548
C  3.01852 -0.633496 1.816503
C  3.162067 -0.391917 0.345959
C  1.876536 0.013126 1.050611
C  3.740379 0.264351 2.792584
C  2.910908 -2.057331 2.304551
C  4.034066 0.649018 -0.230008
C  0.628391 -0.704687 0.735008
C  4.784843 0.490764 -1.324501
C  -1.749312 -0.437405 0.737292
C  4.835778 -0.797223 -2.104803
C  5.62254 1.611871 -1.858757
C  -2.725338 0.061795 1.792375
C  -2.274453 0.108578 -0.568419
C  -3.48062 0.679055 -0.417443
C  -3.880541 0.618087 0.993694
C  -1.511487 -0.065737 -1.827031
C  -4.368779 1.248018 -1.480584
C  -5.06699 0.16846 -2.253423
C  -4.993636 0.019056 -3.570181
H  3.060566 -1.289029 -0.255934
H  1.748012 1.073285 1.239338
H  3.738067 1.311518 2.492376
H  3.275809 0.207097 3.778894
H  4.781307 -0.047906 2.900225
H  2.301053 -2.118076 3.208454
H  2.487901 -2.735493 1.567231
H  3.905165 -2.431581 2.556533
H  4.047107 1.612772 0.270097
H  -1.73344 -1.5290 0.698958
H  5.045611 -1.660024 -1.470737
H  5.611467 -0.763675 -2.87002
H  3.892155 -0.999254 -2.617415
H  6.680506 1.336546 -1.882724
H  5.524544 2.521573 -1.266056
H  5.345263 1.850628 -2.88949
H  -2.287348 0.865371 2.389924
H  -3.055615 -0.716167 2.480877
H  -1.357838 -1.126832 -2.036296
H  -2.018803 0.377696 -2.681118
H  -0.520201 0.387434 -1.754658
H  -3.794596 1.881096 -2.160363
H  -5.114443 1.892836 -1.006625
H  -5.665662 -0.525111 -1.669605
H  -5.52185 -0.777809 -4.078388
H  -4.407897 0.688159 -4.190734
elementType: O C H
totalener: -965.42855168 hartree
nucrepener: 1774.14744234 hartree
electener: -2739.57599403 hartree
oneelecener: -4834.37172388 hartree
twoeener: 2094.79572985 hartree
cpcmener: -0.02781813 hartree
kineticenergy: 960.97944153 hartree
xcener: -95.134624634962 hartree
chargesum: -0.0000000
charge: -0.291811 -0.470788 -0.451134 0.101248 0.049263 -0.104882 -0.272572 -0.277257 -0.300065 0.386227 -0.009444 0.254843 -0.286111 -0.221361 -0.136823 -0.061295 -0.065402 0.298673 -0.239560 -0.097826 -0.181532 -0.282432 0.092793 0.086560 0.088359 0.096895 0.097833 0.097946 0.092435 0.095700 0.115283 0.104740 0.102329 0.095639 0.104860 0.095370 0.084432 0.097572 0.101572 0.096477 0.117879 0.095815 0.114668 0.103824 0.096853 0.142527 0.129241 0.112438
qa: -0.2918 -0.4708 -0.4511 0.1012 0.0493 -0.1049 -0.2726 -0.2773 -0.3001 0.3862 -0.0094 0.2548 -0.2861 -0.2214 -0.1368 -0.0613 -0.0654 0.2987 -0.2396 -0.0978 -0.1815 -0.2824 0.0928 0.0866 0.0884 0.0969 0.0978 0.0979 0.0924 0.0957 0.1153 0.1047 0.1023 0.0956 0.1049 0.0954 0.0844 0.0976 0.1016 0.0965 0.1179 0.0958 0.1147 0.1038 0.0969 0.1425 0.1292 0.1124
va: 2.1241 2.0318 2.0512 3.7047 3.7630 3.8678 3.9138 3.9066 3.9073 4.1861 3.6963 3.7452 3.9413 3.9220 3.9188 3.7875 3.4276 4.0632 3.9335 3.8587 3.7983 3.9402 1.0294 1.0376 1.0062 1.0020 1.0012 0.9996 1.0197 1.0001 1.0116 1.0312 0.9965 1.0042 0.9956 0.9932 1.0104 0.9927 1.0275 1.0255 1.0023 1.0074 1.0030 1.0040 1.0242 1.0039 1.0040 1.0095
dispcorr: -0.021903080 hartree
energy: -965.450454763070
dipole: 24.00468 -21.96217 2.04251 -0.40852 0.63491 0.22639 -8.43283 7.80260 -0.63023
magnitude: 2.14949 au
magnitude: 5.46357 debye
