program: Orca
programVersion: 5.0.2
elementType: O O O C C C C C C C C C C C C C C C C C C C H H H H H H H H H H H H H H H H H H H H H H H H H H
charge: 0
multiplicity: 1
keywords: wb97x-d3
keywords: def2-TZVPP
keywords: def2/J RIJCOSX
keywords: DEFGRID2
keywords: scfconv7
keywords: smallprint printgap noloewdin
keywords: NOSOSCF
formula: C19H26O3
InChI: InChI=1/C19H26O3/c1-7-8-13-12(4)16(10-15(13)20)22-18(21)17-14(9-11(2)3)19(17,5)6/h7,9,14,16-17H,1,8,10H2,2-6H3
48 atoms
O  -0.379776 0.35171 1.67536
O  -0.126238 0.076818 -0.529488
O  -3.935204 2.320837 -0.753798
C  2.395544 -1.547304 0.449248
C  2.804651 -0.222155 -0.116843
C  1.72355 -0.276529 0.946037
C  3.291276 -2.242953 1.446097
C  1.656852 -2.510134 -0.447554
C  4.094118 0.427165 0.18806
C  0.334422 0.059072 0.587205
C  4.86912 1.052254 -0.70372
C  -1.766528 0.671314 1.553984
C  4.524338 1.173497 -2.163221
C  6.148154 1.714059 -0.290551
C  -2.107148 1.953059 0.799763
C  -2.601997 -0.40341 0.905202
C  -3.51248 0.120051 0.069185
C  -3.282743 1.562099 -0.06769
C  -2.415941 -1.828401 1.267125
C  -4.600894 -0.577091 -0.67252
C  -4.223482 -1.06869 -2.039147
C  -3.015138 -1.0340 -2.586504
H  2.420059 -0.035981 -1.1143
H  2.013303 0.02472 1.946757
H  4.092602 -2.778838 0.932802
H  3.752884 -1.558132 2.156523
H  2.722488 -2.975431 2.022386
H  2.373678 -3.172901 -0.93699
H  0.972494 -3.139521 0.126325
H  1.085082 -2.018227 -1.231449
H  4.420477 0.402271 1.223411
H  -2.081605 0.755083 2.596845
H  5.414923 1.371027 -2.760262
H  3.837215 2.004156 -2.341659
H  4.057472 0.275991 -2.567022
H  6.326881 1.63974 0.782307
H  6.14409 2.774392 -0.558729
H  7.004146 1.271411 -0.807237
H  -1.289253 2.314809 0.174609
H  -2.382596 2.770483 1.467679
H  -3.25247 -2.445666 0.943299
H  -1.515485 -2.23012 0.794423
H  -2.288735 -1.951206 2.344248
H  -5.457893 0.096261 -0.772702
H  -4.973414 -1.425497 -0.090164
H  -5.044457 -1.499552 -2.604923
H  -2.848484 -1.426526 -3.581825
H  -2.153194 -0.618828 -2.079313
elementType: O C H
totalener: -965.42634021 hartree
nucrepener: 1835.44946806 hartree
electener: -2800.87580827 hartree
oneelecener: -4957.69000426 hartree
twoeener: 2156.81419598 hartree
cpcmener: -0.03086767 hartree
kineticenergy: 960.99276024 hartree
xcener: -95.141306298907 hartree
chargesum: -0.0000000
charge: -0.296374 -0.473523 -0.450425 0.114424 0.049648 -0.101667 -0.274457 -0.288092 -0.302504 0.386506 -0.013617 0.300501 -0.284736 -0.219774 -0.154875 -0.011367 -0.141337 0.290544 -0.259905 -0.091191 -0.185383 -0.277867 0.091984 0.085994 0.097586 0.088766 0.096458 0.102431 0.093351 0.096142 0.116509 0.118473 0.094599 0.108237 0.099150 0.085029 0.097261 0.092963 0.111853 0.105876 0.106106 0.114634 0.117720 0.091998 0.101514 0.131077 0.127627 0.112132
qa: -0.2964 -0.4735 -0.4504 0.1144 0.0496 -0.1017 -0.2745 -0.2881 -0.3025 0.3865 -0.0136 0.3005 -0.2847 -0.2198 -0.1549 -0.0114 -0.1413 0.2905 -0.2599 -0.0912 -0.1854 -0.2779 0.0920 0.0860 0.0976 0.0888 0.0965 0.1024 0.0934 0.0961 0.1165 0.1185 0.0946 0.1082 0.0992 0.0850 0.0973 0.0930 0.1119 0.1059 0.1061 0.1146 0.1177 0.0920 0.1015 0.1311 0.1276 0.1121
va: 2.1361 2.0269 2.0549 3.6764 3.7725 3.8623 3.9107 3.9070 3.9073 4.1661 3.7113 3.7431 3.9433 3.9256 3.8635 3.6683 3.4505 4.0678 3.9445 3.8401 3.8398 3.8944 1.0318 1.0379 1.0016 1.0064 1.0020 1.0017 1.0008 1.0157 1.0113 0.9921 1.0022 0.9938 0.9992 1.0098 0.9933 0.9945 1.0276 1.0238 1.0029 0.9950 1.0004 1.0160 1.0019 1.0007 1.0054 1.0244
dispcorr: -0.024139876 hartree
energy: -965.450480086665
dipole: 21.49205 -20.12419 1.36786 -10.54084 8.93062 -1.61022 -3.02219 4.99523 1.97303
magnitude: 2.89080 au
magnitude: 7.34782 debye
