program: Orca
programVersion: 5.0.2
elementType: O O O C C C C C C C C C C C C C C C C C C C H H H H H H H H H H H H H H H H H H H H H H H H H H
charge: 0
multiplicity: 1
keywords: wb97x-d3
keywords: def2-TZVPP
keywords: def2/J RIJCOSX
keywords: DEFGRID2
keywords: scfconv7
keywords: smallprint printgap noloewdin
keywords: NOSOSCF
formula: C19H26O3
InChI: InChI=1/C19H26O3/c1-7-8-13-12(4)16(10-15(13)20)22-18(21)17-14(9-11(2)3)19(17,5)6/h7,9,14,16-17H,1,8,10H2,2-6H3
48 atoms
O  -0.474686 0.037225 0.248377
O  0.707427 1.553061 1.385472
O  -4.579987 1.97282 -0.407168
C  2.71368 1.146325 -1.003886
C  3.200963 0.360437 0.176456
C  1.766589 0.198628 -0.286681
C  3.12757 0.728241 -2.393574
C  2.568336 2.6411 -0.857607
C  4.121717 -0.788491 0.041151
C  0.653999 0.686775 0.545423
C  5.294187 -0.94504 0.663783
C  -1.664048 0.407303 0.951162
C  5.896367 0.048689 1.609077
C  6.119007 -2.178007 0.444936
C  -2.31653 1.676197 0.414509
C  -2.671917 -0.68449 0.714148
C  -3.826932 -0.205582 0.227124
C  -3.708844 1.242768 0.015358
C  -2.336686 -2.094248 1.026549
C  -5.061615 -0.978762 -0.115888
C  -4.917984 -1.676477 -1.436647
C  -4.978093 -2.991809 -1.602113
H  3.309761 0.950203 1.080807
H  1.543483 -0.712783 -0.830701
H  3.142804 -0.352996 -2.525246
H  2.440154 1.13882 -3.135965
H  4.126275 1.10453 -2.624749
H  1.749908 3.022027 -1.472424
H  2.395345 2.959658 0.16794
H  3.484802 3.128419 -1.196852
H  3.799127 -1.578644 -0.631064
H  -1.446917 0.481604 2.020747
H  6.015806 -0.384396 2.605925
H  5.31853 0.965141 1.712263
H  6.899131 0.329384 1.276218
H  6.293319 -2.706124 1.386514
H  7.10577 -1.926153 0.047108
H  5.646062 -2.874798 -0.247047
H  -1.791303 2.067983 -0.459835
H  -2.361716 2.478892 1.151398
H  -1.709373 -2.520805 0.239482
H  -1.770018 -2.167557 1.956429
H  -3.223752 -2.71948 1.111628
H  -5.910978 -0.291016 -0.156652
H  -5.282207 -1.707853 0.666977
H  -4.744672 -1.036164 -2.296802
H  -4.863329 -3.444549 -2.579051
H  -5.148607 -3.666685 -0.770694
elementType: O C H
totalener: -965.43058359 hartree
nucrepener: 1769.10423927 hartree
electener: -2734.53482286 hartree
oneelecener: -4824.37491421 hartree
twoeener: 2089.84009135 hartree
cpcmener: -0.02915983 hartree
kineticenergy: 960.99123206 hartree
xcener: -95.135334161071 hartree
chargesum: -0.0000000
charge: -0.292577 -0.470217 -0.449009 0.116284 0.032003 -0.096601 -0.264386 -0.282173 -0.278868 0.384953 -0.039633 0.244799 -0.252479 -0.221292 -0.142242 -0.047800 -0.055112 0.295994 -0.277871 -0.100333 -0.177337 -0.282090 0.094242 0.088075 0.087244 0.097445 0.096903 0.098465 0.094338 0.096540 0.117206 0.103511 0.097089 0.089622 0.093877 0.093222 0.093110 0.088580 0.102020 0.103655 0.115996 0.118386 0.100854 0.095908 0.105449 0.142767 0.129149 0.112335
qa: -0.2926 -0.4702 -0.4490 0.1163 0.0320 -0.0966 -0.2644 -0.2822 -0.2789 0.3850 -0.0396 0.2448 -0.2525 -0.2213 -0.1422 -0.0478 -0.0551 0.2960 -0.2779 -0.1003 -0.1773 -0.2821 0.0942 0.0881 0.0872 0.0974 0.0969 0.0985 0.0943 0.0965 0.1172 0.1035 0.0971 0.0896 0.0939 0.0932 0.0931 0.0886 0.1020 0.1037 0.1160 0.1184 0.1009 0.0959 0.1054 0.1428 0.1291 0.1123
va: 2.1277 2.0394 2.0566 3.6858 3.7742 3.8781 3.9061 3.9045 3.8751 4.1576 3.7459 3.7680 3.9434 3.9231 3.8937 3.7493 3.4409 4.0704 3.9497 3.8517 3.7987 3.9401 1.0301 1.0368 1.0056 1.0023 1.0026 0.9997 1.0189 1.0004 1.0103 1.0170 0.9967 1.0093 0.9978 0.9957 0.9968 1.0087 1.0252 1.0233 0.9989 1.0024 1.0035 1.0248 1.0039 1.0030 1.0041 1.0095
dispcorr: -0.021798759 hartree
energy: -965.452382353926
dipole: 23.12630 -21.54285 1.58345 -9.35506 7.44369 -1.91136 -3.72819 3.84090 0.11272
magnitude: 2.48462 au
magnitude: 6.31540 debye
