program: Orca
programVersion: 5.0.2
elementType: O O O C C C C C C C C C C C C C C C C C C C H H H H H H H H H H H H H H H H H H H H H H H H H H
charge: 0
multiplicity: 1
keywords: wb97x-d3
keywords: def2-TZVPP
keywords: def2/J RIJCOSX
keywords: DEFGRID2
keywords: scfconv7
keywords: smallprint printgap noloewdin
keywords: NOSOSCF
formula: C19H26O3
InChI: InChI=1/C19H26O3/c1-7-8-13-12(4)16(10-15(13)20)22-18(21)17-14(9-11(2)3)19(17,5)6/h7,9,14,16-17H,1,8,10H2,2-6H3
48 atoms
O  -0.338574 0.012961 1.442433
O  0.138539 0.091095 -0.742006
O  -3.786805 2.34322 -0.822613
C  2.663377 -1.512257 0.390901
C  3.036372 -0.144949 -0.099475
C  1.875886 -0.300196 0.861662
C  3.505517 -2.193352 1.441975
C  2.057264 -2.479384 -0.595629
C  4.249606 0.569045 0.343611
C  0.497003 -0.043957 0.403199
C  5.066174 1.300059 -0.422805
C  -1.724815 0.282848 1.232766
C  4.895657 1.514055 -1.896587
C  6.249234 2.003418 0.172562
C  -2.062973 1.690158 0.754343
C  -2.413749 -0.640739 0.260503
C  -3.240429 0.031761 -0.555228
C  -3.131869 1.4700 -0.291992
C  -2.213578 -2.10834 0.337916
C  -4.180074 -0.522062 -1.570246
C  -5.547819 -0.848982 -1.04445
C  -5.94661 -0.785288 0.219733
H  2.728872 0.046954 -1.121715
H  2.060712 -0.020597 1.89338
H  3.883255 -1.505428 2.197343
H  2.922047 -2.957198 1.959969
H  4.364836 -2.688851 0.985064
H  1.372966 -3.171087 -0.099204
H  1.515939 -1.987397 -1.401538
H  2.847459 -3.076845 -1.055226
H  4.48324 0.502076 1.40238
H  -2.153762 0.109014 2.222743
H  5.843552 1.35943 -2.418053
H  4.595626 2.545234 -2.105213
H  4.159184 0.857956 -2.356969
H  6.200238 3.079781 -0.015043
H  7.182681 1.656151 -0.278645
H  6.320896 1.854886 1.250159
H  -1.211205 2.201617 0.301196
H  -2.431219 2.331751 1.555655
H  -1.270957 -2.397779 -0.134347
H  -2.161474 -2.442014 1.375718
H  -3.011929 -2.657257 -0.158444
H  -3.759446 -1.422905 -2.027043
H  -4.28733 0.189428 -2.394723
H  -6.255647 -1.174836 -1.80083
H  -6.959951 -1.049264 0.494673
H  -5.294964 -0.46756 1.025132
elementType: O C H
totalener: -965.42664530 hartree
nucrepener: 1810.58769882 hartree
electener: -2776.01434412 hartree
oneelecener: -4907.73702152 hartree
twoeener: 2131.72267740 hartree
cpcmener: -0.03205881 hartree
kineticenergy: 960.98758527 hartree
xcener: -95.140417677384 hartree
chargesum: 0.0000000
charge: -0.293096 -0.461263 -0.452985 0.115690 0.036648 -0.108171 -0.273998 -0.286301 -0.281623 0.386128 -0.043757 0.284879 -0.257802 -0.217752 -0.148518 0.004889 -0.135755 0.291296 -0.266912 -0.091053 -0.184176 -0.275445 0.089962 0.087757 0.088232 0.096776 0.097359 0.095148 0.093942 0.102663 0.116235 0.116089 0.092224 0.100686 0.092471 0.092437 0.093201 0.087138 0.110223 0.103793 0.119972 0.113757 0.105769 0.100243 0.093968 0.129712 0.129972 0.109348
qa: -0.2931 -0.4613 -0.4530 0.1157 0.0366 -0.1082 -0.2740 -0.2863 -0.2816 0.3861 -0.0438 0.2849 -0.2578 -0.2178 -0.1485 0.0049 -0.1358 0.2913 -0.2669 -0.0911 -0.1842 -0.2754 0.0900 0.0878 0.0882 0.0968 0.0974 0.0951 0.0939 0.1027 0.1162 0.1161 0.0922 0.1007 0.0925 0.0924 0.0932 0.0871 0.1102 0.1038 0.1200 0.1138 0.1058 0.1002 0.0940 0.1297 0.1300 0.1093
va: 2.1330 2.0529 2.0518 3.6814 3.7832 3.8232 3.9088 3.9052 3.8866 4.2064 3.7589 3.7748 3.9408 3.9227 3.8753 3.6355 3.4555 4.0735 3.9414 3.8455 3.8322 3.9068 1.0338 1.0375 1.0066 1.0016 1.0019 0.9999 1.0160 1.0022 1.0118 0.9937 0.9982 0.9953 1.0086 0.9955 0.9966 1.0091 1.0247 1.0247 0.9951 1.0003 1.0024 1.0008 1.0177 1.0032 1.0043 1.0158
dispcorr: -0.023434496 hartree
energy: -965.450079795679
dipole: 20.14497 -18.59994 1.54504 -9.30072 7.40947 -1.89126 -0.39106 1.81181 1.42074
magnitude: 2.82533 au
magnitude: 7.18142 debye
