program: Orca
programVersion: 5.0.2
elementType: O O O C C C C C C C C C C C C C C C C C C C H H H H H H H H H H H H H H H H H H H H H H H H H H
charge: 0
multiplicity: 1
keywords: wb97x-d3
keywords: def2-TZVPP
keywords: def2/J RIJCOSX
keywords: DEFGRID2
keywords: scfconv7
keywords: smallprint printgap noloewdin
keywords: NOSOSCF
formula: C19H26O3
InChI: InChI=1/C19H26O3/c1-7-8-13-12(4)16(10-15(13)20)22-18(21)17-14(9-11(2)3)19(17,5)6/h7,9,14,16-17H,1,8,10H2,2-6H3
48 atoms
O  -0.439712 -0.002767 0.306089
O  0.691412 1.860632 0.788548
O  -4.653717 1.460813 -0.901998
C  2.770603 0.598174 -1.20719
C  3.230648 0.357413 0.197978
C  1.817734 -0.014007 -0.191458
C  3.243346 -0.330248 -2.298834
C  2.592613 2.021742 -1.673615
C  4.182541 -0.725555 0.543332
C  0.671371 0.733777 0.353374
C  5.46329 -0.557209 0.884685
C  -1.648037 0.568973 0.811902
C  6.146257 0.774132 0.952513
C  6.329892 -1.73078 1.227713
C  -2.339346 1.510496 -0.166925
C  -2.618078 -0.56296 1.025264
C  -3.797998 -0.325586 0.432895
C  -3.736493 0.947412 -0.297999
C  -2.220833 -1.735885 1.840304
C  -5.02519 -1.177774 0.412222
C  -5.065203 -2.004819 -0.840364
C  -5.942286 -1.846264 -1.822857
H  3.306477 1.259531 0.797913
H  1.629885 -1.072866 -0.334393
H  4.240153 -0.042314 -2.640079
H  3.293281 -1.370349 -1.977655
H  2.573687 -0.28299 -3.160074
H  3.512411 2.363107 -2.153749
H  1.791435 2.099511 -2.412093
H  2.373864 2.715607 -0.864958
H  3.793985 -1.73961 0.507985
H  -1.444312 1.060215 1.768208
H  5.496594 1.611194 0.702394
H  6.996399 0.801478 0.265402
H  6.554649 0.952838 1.950887
H  6.722447 -1.646064 2.244647
H  7.198647 -1.785531 0.566358
H  5.791692 -2.6759 1.15436
H  -1.85507 1.499554 -1.146697
H  -2.365254 2.546327 0.172057
H  -3.069735 -2.364404 2.103024
H  -1.504422 -2.357344 1.298195
H  -1.726901 -1.419409 2.761192
H  -5.914268 -0.54596 0.471779
H  -5.039077 -1.833203 1.2862
H  -4.294854 -2.766106 -0.926901
H  -5.913723 -2.466364 -2.709873
H  -6.720656 -1.093018 -1.779262
elementType: O C H
totalener: -965.43018798 hartree
nucrepener: 1766.86381047 hartree
electener: -2732.29399845 hartree
oneelecener: -4820.01989512 hartree
twoeener: 2087.72589667 hartree
cpcmener: -0.03041835 hartree
kineticenergy: 960.99983788 hartree
xcener: -95.136486677754 hartree
chargesum: -0.0000000
charge: -0.293837 -0.471160 -0.445702 0.146373 -0.001124 -0.117117 -0.260813 -0.293895 -0.264901 0.391595 -0.033940 0.246741 -0.250996 -0.227965 -0.139249 -0.047688 -0.055095 0.285162 -0.267493 -0.103989 -0.174173 -0.274796 0.097591 0.089880 0.095219 0.089100 0.098087 0.095822 0.099522 0.094109 0.118920 0.103985 0.088723 0.095655 0.096834 0.094551 0.093272 0.088319 0.103075 0.102065 0.102076 0.110563 0.114109 0.093486 0.110353 0.139156 0.127981 0.111609
qa: -0.2938 -0.4712 -0.4457 0.1464 -0.0011 -0.1171 -0.2608 -0.2939 -0.2649 0.3916 -0.0339 0.2467 -0.2510 -0.2280 -0.1392 -0.0477 -0.0551 0.2852 -0.2675 -0.1040 -0.1742 -0.2748 0.0976 0.0899 0.0952 0.0891 0.0981 0.0958 0.0995 0.0941 0.1189 0.1040 0.0887 0.0957 0.0968 0.0946 0.0933 0.0883 0.1031 0.1021 0.1021 0.1106 0.1141 0.0935 0.1104 0.1392 0.1280 0.1116
va: 2.1282 2.0383 2.0567 3.6713 3.7803 3.9142 3.9031 3.9032 3.8724 4.1622 3.7109 3.7668 3.9434 3.9267 3.8980 3.7518 3.4343 4.0851 3.9534 3.8554 3.7891 3.9503 1.0250 1.0362 1.0032 1.0036 1.0028 1.0008 0.9996 1.0186 1.0080 1.0171 1.0085 0.9975 0.9978 0.9954 0.9964 1.0083 1.0251 1.0253 1.0053 1.0008 0.9988 1.0212 1.0058 1.0015 1.0032 1.0136
dispcorr: -0.021953656 hartree
energy: -965.452141632560
dipole: 23.47464 -21.68397 1.79067 -8.17216 6.34526 -1.82690 -2.18443 2.97731 0.79288
magnitude: 2.67819 au
magnitude: 6.80743 debye
