program: Orca
programVersion: 5.0.2
elementType: O O O C C C C C C C C C C C C C C C C C C C H H H H H H H H H H H H H H H H H H H H H H H H H H
charge: 0
multiplicity: 1
keywords: wb97x-d3
keywords: def2-TZVPP
keywords: def2/J RIJCOSX
keywords: DEFGRID2
keywords: scfconv7
keywords: smallprint printgap noloewdin
keywords: NOSOSCF
formula: C19H26O3
InChI: InChI=1/C19H26O3/c1-7-8-13-12(4)16(10-15(13)20)22-18(21)17-14(9-11(2)3)19(17,5)6/h7,9,14,16-17H,1,8,10H2,2-6H3
48 atoms
O  -0.430788 0.104948 0.300059
O  0.715014 2.021717 0.330325
O  -4.568915 1.181202 -1.300152
C  2.751351 0.37811 -1.398936
C  3.229089 0.375274 0.02151
C  1.79988 -0.026393 -0.285166
C  3.186606 -0.732308 -2.324592
C  2.596877 1.702979 -2.103766
C  4.150489 -0.65662 0.546226
C  0.679053 0.828602 0.141906
C  5.3590 -0.445785 1.076727
C  -1.625575 0.785762 0.695653
C  6.004506 0.899255 1.212664
C  6.184361 -1.590198 1.584322
C  -2.31797 1.510818 -0.452581
C  -2.600424 -0.271277 1.143998
C  -3.762364 -0.196368 0.477323
C  -3.684695 0.868569 -0.532144
C  -2.216829 -1.225843 2.211828
C  -4.97888 -1.053952 0.612885
C  -4.948968 -2.172313 -0.388214
C  -5.798182 -2.307001 -1.3989
H  3.328919 1.365352 0.455452
H  1.589673 -1.089442 -0.235574
H  4.181956 -0.526559 -2.724174
H  3.22107 -1.705017 -1.835284
H  2.502613 -0.815199 -3.17155
H  3.51357 1.929114 -2.652385
H  1.782237 1.671324 -2.830259
H  2.412323 2.533422 -1.426317
H  3.796432 -1.682334 0.49028
H  -1.401872 1.45896 1.528013
H  5.419141 1.712199 0.787186
H  6.979726 0.904169 0.719227
H  6.191919 1.136355 2.263065
H  5.660224 -2.542967 1.508351
H  6.4616 -1.441491 2.631506
H  7.12144 -1.676553 1.027441
H  -1.793319 1.37869 -1.401896
H  -2.411286 2.584308 -0.282012
H  -1.70703 -0.712651 3.029425
H  -3.074779 -1.758052 2.619052
H  -1.519033 -1.973132 1.826355
H  -5.876099 -0.447739 0.46825
H  -5.03131 -1.468933 1.622479
H  -4.152331 -2.899203 -0.257715
H  -5.718668 -3.131465 -2.095544
H  -6.600923 -1.599127 -1.57109
elementType: O C H
totalener: -965.43049606 hartree
nucrepener: 1768.06473035 hartree
electener: -2733.49522641 hartree
oneelecener: -4822.45246790 hartree
twoeener: 2088.95724148 hartree
cpcmener: -0.03065767 hartree
kineticenergy: 960.99246567 hartree
xcener: -95.135282538231 hartree
chargesum: 0.0000000
charge: -0.292387 -0.471346 -0.445977 0.124840 0.028866 -0.107108 -0.261189 -0.286289 -0.280566 0.385861 -0.034845 0.247762 -0.253041 -0.223098 -0.141502 -0.047000 -0.057982 0.285251 -0.266773 -0.104636 -0.176688 -0.274242 0.095191 0.088057 0.096446 0.087376 0.097916 0.095725 0.099171 0.094995 0.117522 0.103767 0.089884 0.094438 0.097158 0.088121 0.092807 0.094166 0.101612 0.104966 0.113427 0.103491 0.111210 0.093642 0.110805 0.139911 0.128303 0.111981
qa: -0.2924 -0.4713 -0.4460 0.1248 0.0289 -0.1071 -0.2612 -0.2863 -0.2806 0.3859 -0.0348 0.2478 -0.2530 -0.2231 -0.1415 -0.0470 -0.0580 0.2853 -0.2668 -0.1046 -0.1767 -0.2742 0.0952 0.0881 0.0964 0.0874 0.0979 0.0957 0.0992 0.0950 0.1175 0.1038 0.0899 0.0944 0.0972 0.0881 0.0928 0.0942 0.1016 0.1050 0.1134 0.1035 0.1112 0.0936 0.1108 0.1399 0.1283 0.1120
va: 2.1282 2.0379 2.0570 3.6817 3.7705 3.8963 3.9043 3.9021 3.8774 4.1559 3.7351 3.7676 3.9445 3.9239 3.8958 3.7513 3.4361 4.0819 3.9523 3.8557 3.7891 3.9513 1.0282 1.0375 1.0028 1.0051 1.0025 1.0006 0.9994 1.0193 1.0097 1.0171 1.0088 0.9974 0.9970 1.0089 0.9958 0.9963 1.0266 1.0222 0.9995 1.0045 1.0001 1.0214 1.0053 1.0012 1.0030 1.0131
dispcorr: -0.021699475 hartree
energy: -965.452195534836
dipole: 22.89862 -21.21361 1.68502 -8.53257 7.00840 -1.52416 0.46174 0.83759 1.29933
magnitude: 2.61737 au
magnitude: 6.65282 debye
