program: Orca
programVersion: 5.0.2
elementType: O O O C C C C C C C C C C C C C C C C C C C H H H H H H H H H H H H H H H H H H H H H H H H H H
charge: 0
multiplicity: 1
keywords: wb97x-d3
keywords: def2-TZVPP
keywords: def2/J RIJCOSX
keywords: DEFGRID2
keywords: scfconv7
keywords: smallprint printgap noloewdin
keywords: NOSOSCF
formula: C19H26O3
InChI: InChI=1/C19H26O3/c1-7-8-13-12(4)16(10-15(13)20)22-18(21)17-14(9-11(2)3)19(17,5)6/h7,9,14,16-17H,1,8,10H2,2-6H3
48 atoms
O  -0.115787 0.23267 1.18187
O  0.203298 -0.18388 -0.992241
O  -3.650573 2.108475 -1.370481
C  2.691673 -1.752403 0.196788
C  3.123106 -0.48606 -0.457767
C  2.005817 -0.439849 0.562908
C  3.551167 -2.348695 1.285109
C  1.967732 -2.791623 -0.622761
C  4.421227 0.168134 -0.148061
C  0.632152 -0.128981 0.136021
C  4.598061 1.488716 -0.062439
C  -1.497522 0.534564 0.994303
C  3.486598 2.47431 -0.264137
C  5.932653 2.082909 0.266642
C  -1.814817 1.788068 0.185849
C  -2.295379 -0.568816 0.345462
C  -3.162569 -0.081763 -0.555392
C  -2.978725 1.367894 -0.683101
C  -2.13348 -1.973414 0.792023
C  -4.212308 -0.805014 -1.325659
C  -5.581698 -0.744004 -0.713001
C  -5.893467 -0.245378 0.476809
H  2.779163 -0.373006 -1.484036
H  2.266358 -0.054481 1.542358
H  2.951097 -2.977606 1.945503
H  4.335166 -2.977364 0.857084
H  4.033853 -1.591054 1.902648
H  1.381153 -2.367124 -1.434803
H  2.692412 -3.475484 -1.069856
H  1.299264 -3.389228 0.001032
H  5.276648 -0.483574 0.007931
H  -1.858342 0.650941 2.019293
H  3.831844 3.336757 -0.838613
H  3.133649 2.863708 0.695388
H  2.627266 2.052847 -0.783581
H  6.680422 1.32188 0.490167
H  5.860549 2.749407 1.130344
H  6.3071 2.691831 -0.560632
H  -0.985221 2.108058 -0.447404
H  -2.085703 2.638018 0.813124
H  -2.138361 -2.035159 1.882177
H  -2.921008 -2.620032 0.410005
H  -1.177388 -2.385562 0.459102
H  -3.936106 -1.854667 -1.461177
H  -4.268975 -0.39374 -2.338292
H  -6.372104 -1.162524 -1.328837
H  -6.916639 -0.254281 0.830603
H  -5.156319 0.186747 1.143458
elementType: O C H
totalener: -965.42503534 hartree
nucrepener: 1835.14013497 hartree
electener: -2800.56517031 hartree
oneelecener: -4956.83545098 hartree
twoeener: 2156.27028067 hartree
cpcmener: -0.03133458 hartree
kineticenergy: 960.99918596 hartree
xcener: -95.141906944109 hartree
chargesum: -0.0000000
charge: -0.297754 -0.467089 -0.451421 0.156188 -0.008801 -0.109869 -0.286386 -0.296180 -0.311086 0.369506 0.000813 0.286698 -0.250907 -0.228488 -0.148492 0.015244 -0.144430 0.285760 -0.259703 -0.094542 -0.182730 -0.273717 0.103149 0.091008 0.096595 0.099214 0.093377 0.097669 0.102759 0.094007 0.121582 0.116661 0.102278 0.102947 0.083901 0.088123 0.094459 0.096431 0.112257 0.103560 0.112978 0.103484 0.117614 0.099137 0.096319 0.130432 0.129989 0.107458
qa: -0.2978 -0.4671 -0.4514 0.1562 -0.0088 -0.1099 -0.2864 -0.2962 -0.3111 0.3695 0.0008 0.2867 -0.2509 -0.2285 -0.1485 0.0152 -0.1444 0.2858 -0.2597 -0.0945 -0.1827 -0.2737 0.1031 0.0910 0.0966 0.0992 0.0934 0.0977 0.1028 0.0940 0.1216 0.1167 0.1023 0.1029 0.0839 0.0881 0.0945 0.0964 0.1123 0.1036 0.1130 0.1035 0.1176 0.0991 0.0963 0.1304 0.1300 0.1075
va: 2.1251 2.0398 2.0523 3.6978 3.8134 3.8171 3.9047 3.8918 3.8998 4.1779 3.6879 3.7753 3.9401 3.9348 3.8734 3.6234 3.4656 4.0809 3.9525 3.8460 3.8301 3.9086 1.0254 1.0331 1.0033 0.9998 1.0022 1.0168 1.0029 1.0004 1.0038 0.9933 1.0011 0.9967 1.0128 1.0064 0.9957 0.9961 1.0254 1.0250 0.9994 1.0023 0.9933 1.0034 1.0144 1.0028 1.0041 1.0157
dispcorr: -0.024549164 hartree
energy: -965.449584506185
dipole: 16.90950 -15.38076 1.52874 -7.04600 5.61335 -1.43264 4.86663 -2.92170 1.94493
magnitude: 2.85872 au
magnitude: 7.26629 debye
