program: Orca
programVersion: 5.0.2
elementType: O O O C C C C C C C C C C C C C C C C C C C H H H H H H H H H H H H H H H H H H H H H H H H H H
charge: 0
multiplicity: 1
keywords: wb97x-d3
keywords: def2-TZVPP
keywords: def2/J RIJCOSX
keywords: DEFGRID2
keywords: scfconv7
keywords: smallprint printgap noloewdin
keywords: NOSOSCF
formula: C19H26O3
InChI: InChI=1/C19H26O3/c1-7-8-13-12(4)16(10-15(13)20)22-18(21)17-14(9-11(2)3)19(17,5)6/h7,9,14,16-17H,1,8,10H2,2-6H3
48 atoms
O  -0.305491 0.090512 1.536691
O  0.153327 0.067025 -0.651249
O  -3.838734 2.129047 -0.882044
C  2.686049 -1.47563 0.503202
C  3.052771 -0.125607 -0.037105
C  1.908122 -0.246616 0.948051
C  3.555189 -2.123625 1.553429
C  2.055302 -2.476299 -0.43346
C  4.275369 0.594971 0.369686
C  0.523306 -0.012912 0.495423
C  5.091121 1.286583 -0.432562
C  -1.699704 0.304147 1.311447
C  4.899086 1.440119 -1.912588
C  6.282855 2.006887 0.12326
C  -2.083164 1.659634 0.726907
C  -2.357555 -0.715204 0.41341
C  -3.209335 -0.133497 -0.445767
C  -3.14888 1.324333 -0.291258
C  -2.107971 -2.162575 0.614997
C  -4.159393 -0.773759 -1.406691
C  -5.534147 -0.859407 -0.809516
C  -6.586465 -0.167449 -1.227495
H  2.731423 0.040164 -1.059884
H  2.107007 0.069897 1.966392
H  4.408637 -2.621733 1.088205
H  3.943678 -1.415382 2.283911
H  2.991239 -2.880964 2.101528
H  1.375593 -3.141622 0.104133
H  1.501084 -2.014587 -1.248109
H  2.831607 -3.098997 -0.882804
H  4.515026 0.570413 1.428784
H  -2.12337 0.194615 2.312696
H  5.860353 1.415074 -2.43052
H  4.446727 2.407982 -2.148604
H  4.270436 0.668684 -2.354715
H  6.252317 3.070039 -0.131518
H  7.21206 1.616927 -0.301055
H  6.347867 1.924493 1.20834
H  -1.249915 2.158945 0.22857
H  -2.467052 2.350779 1.477946
H  -2.292439 -2.439923 1.65547
H  -2.738112 -2.783284 -0.018574
H  -1.068186 -2.42341 0.403905
H  -3.807897 -1.774413 -1.668226
H  -4.18966 -0.196137 -2.333459
H  -5.637467 -1.528794 0.040095
H  -7.551173 -0.263351 -0.745152
H  -6.526432 0.518601 -2.064627
elementType: O C H
totalener: -965.42645846 hartree
nucrepener: 1802.90380651 hartree
electener: -2768.33026497 hartree
oneelecener: -4892.46052568 hartree
twoeener: 2124.13026071 hartree
cpcmener: -0.03241745 hartree
kineticenergy: 960.98756422 hartree
xcener: -95.138728482796 hartree
chargesum: 0.0000000
charge: -0.294315 -0.460912 -0.453361 0.115481 0.045678 -0.102944 -0.273746 -0.292576 -0.293349 0.374000 -0.030844 0.275688 -0.268318 -0.218333 -0.147005 0.008980 -0.117603 0.276836 -0.257117 -0.115385 -0.175495 -0.278636 0.089833 0.088003 0.097347 0.088682 0.096372 0.094730 0.097093 0.104270 0.115831 0.117879 0.092738 0.104139 0.095320 0.093650 0.092898 0.086332 0.111117 0.104207 0.113758 0.101389 0.114316 0.107105 0.097600 0.139213 0.127710 0.111746
qa: -0.2943 -0.4609 -0.4534 0.1155 0.0457 -0.1029 -0.2737 -0.2926 -0.2933 0.3740 -0.0308 0.2757 -0.2683 -0.2183 -0.1470 0.0090 -0.1176 0.2768 -0.2571 -0.1154 -0.1755 -0.2786 0.0898 0.0880 0.0973 0.0887 0.0964 0.0947 0.0971 0.1043 0.1158 0.1179 0.0927 0.1041 0.0953 0.0936 0.0929 0.0863 0.1111 0.1042 0.1138 0.1014 0.1143 0.1071 0.0976 0.1392 0.1277 0.1117
va: 2.1328 2.0515 2.0480 3.6761 3.7792 3.8263 3.9085 3.9039 3.8970 4.2178 3.7398 3.7877 3.9421 3.9252 3.8845 3.6390 3.4668 4.0904 3.9540 3.8748 3.7900 3.9547 1.0340 1.0373 1.0019 1.0065 1.0020 0.9999 1.0163 1.0021 1.0116 0.9918 0.9987 0.9943 1.0054 0.9948 0.9960 1.0094 1.0256 1.0249 0.9976 1.0045 0.9954 1.0062 1.0195 1.0006 1.0033 1.0136
dispcorr: -0.023010281 hartree
energy: -965.449468743975
dipole: 19.87328 -18.24626 1.62701 -8.54857 6.76784 -1.78073 -0.99734 2.71260 1.71527
magnitude: 2.95978 au
magnitude: 7.52317 debye
