program: Orca
programVersion: 5.0.2
elementType: O O O C C C C C C C C C C C C C C C C C C C H H H H H H H H H H H H H H H H H H H H H H H H H H
charge: 0
multiplicity: 1
keywords: wb97x-d3
keywords: def2-TZVPP
keywords: def2/J RIJCOSX
keywords: DEFGRID2
keywords: scfconv7
keywords: smallprint printgap noloewdin
keywords: NOSOSCF
formula: C19H26O3
InChI: InChI=1/C19H26O3/c1-7-8-13-12(4)16(10-15(13)20)22-18(21)17-14(9-11(2)3)19(17,5)6/h7,9,14,16-17H,1,8,10H2,2-6H3
48 atoms
O  -0.389362 0.100168 1.02799
O  0.519745 -1.942198 1.191132
O  -4.857224 1.291007 1.090456
C  3.068415 -0.32282 2.060406
C  3.176066 -0.694583 0.62342
C  1.915583 -0.000166 1.119641
C  3.822433 0.883025 2.568198
C  2.943815 -1.417969 3.090955
C  4.088185 -0.006372 -0.324534
C  0.644323 -0.741894 1.125641
C  3.919163 0.034992 -1.648884
C  -1.722993 -0.412795 0.983967
C  2.747094 -0.579912 -2.349071
C  4.914324 0.710371 -2.541433
C  -2.665656 0.494248 1.761197
C  -2.249784 -0.399601 -0.428704
C  -3.444947 0.207488 -0.507093
C  -3.813791 0.739955 0.81039
C  -1.4887 -1.030065 -1.533922
C  -4.303709 0.376932 -1.721051
C  -3.774015 1.447813 -2.628056
C  -3.421212 1.256187 -3.893024
H  3.024912 -1.753313 0.426735
H  1.819717 1.049472 0.866736
H  4.851249 0.617698 2.821566
H  3.857263 1.695793 1.842329
H  3.351949 1.272846 3.472945
H  2.355199 -1.087941 3.949782
H  2.490758 -2.326267 2.699586
H  3.937885 -1.683555 3.458174
H  4.970435 0.467379 0.096479
H  -1.741744 -1.433117 1.374018
H  2.016043 -1.01479 -1.668853
H  3.075425 -1.368013 -3.032367
H  2.232813 0.162844 -2.964941
H  4.446191 1.515735 -3.113846
H  5.324186 0.010195 -3.274436
H  5.747425 1.135502 -1.981573
H  -2.190069 1.450772 1.993533
H  -3.010769 0.063551 2.70141
H  -1.072502 -1.991927 -1.23073
H  -2.103917 -1.184384 -2.41875
H  -0.646847 -0.396772 -1.827426
H  -5.316534 0.639188 -1.402047
H  -4.380689 -0.566601 -2.266611
H  -3.678642 2.438093 -2.191998
H  -3.040628 2.06658 -4.501832
H  -3.496575 0.284515 -4.368008
elementType: O C H
totalener: -965.42781424 hartree
nucrepener: 1807.55369926 hartree
electener: -2772.98151350 hartree
oneelecener: -4901.07078497 hartree
twoeener: 2128.08927147 hartree
cpcmener: -0.02710997 hartree
kineticenergy: 960.98772450 hartree
xcener: -95.135766436755 hartree
chargesum: 0.0000000
charge: -0.290341 -0.472413 -0.450319 0.154094 -0.033225 -0.093676 -0.292448 -0.276651 -0.282404 0.377326 -0.010794 0.253714 -0.237399 -0.228667 -0.136249 -0.029268 -0.073993 0.290597 -0.274403 -0.093631 -0.181848 -0.282414 0.103038 0.089289 0.099582 0.091719 0.097878 0.098763 0.092944 0.094593 0.122344 0.102466 0.068993 0.102341 0.097336 0.094723 0.094578 0.089188 0.100087 0.097885 0.118888 0.106172 0.118429 0.093932 0.104666 0.142658 0.129588 0.112331
qa: -0.2903 -0.4724 -0.4503 0.1541 -0.0332 -0.0937 -0.2924 -0.2767 -0.2824 0.3773 -0.0108 0.2537 -0.2374 -0.2287 -0.1362 -0.0293 -0.0740 0.2906 -0.2744 -0.0936 -0.1818 -0.2824 0.1030 0.0893 0.0996 0.0917 0.0979 0.0988 0.0929 0.0946 0.1223 0.1025 0.0690 0.1023 0.0973 0.0947 0.0946 0.0892 0.1001 0.0979 0.1189 0.1062 0.1184 0.0939 0.1047 0.1427 0.1296 0.1123
va: 2.1218 2.0297 2.0540 3.7035 3.8256 3.8051 3.9150 3.8873 3.8858 4.1754 3.7043 3.7538 3.9451 3.9294 3.9055 3.7140 3.4483 4.0658 3.9217 3.8556 3.8000 3.9372 1.0257 1.0350 0.9990 1.0013 1.0028 0.9994 1.0190 1.0009 1.0033 1.0319 1.0137 0.9996 0.9981 0.9967 0.9958 1.0066 1.0283 1.0250 1.0122 1.0057 0.9962 1.0267 1.0044 1.0022 1.0040 1.0097
dispcorr: -0.023274559 hartree
energy: -965.451088803454
dipole: 21.36724 -19.49480 1.87244 0.22981 -0.33238 -0.10257 -9.92878 9.10088 -0.82790
magnitude: 2.04987 au
magnitude: 5.21036 debye
