program: Orca
programVersion: 5.0.2
elementType: O O O C C C C C C C C C C C C C C C C C C C H H H H H H H H H H H H H H H H H H H H H H H H H H
charge: 0
multiplicity: 1
keywords: wb97x-d3
keywords: def2-TZVPP
keywords: def2/J RIJCOSX
keywords: DEFGRID2
keywords: scfconv7
keywords: smallprint printgap noloewdin
keywords: NOSOSCF
formula: C19H26O3
InChI: InChI=1/C19H26O3/c1-7-8-13-12(4)16(10-15(13)20)22-18(21)17-14(9-11(2)3)19(17,5)6/h7,9,14,16-17H,1,8,10H2,2-6H3
48 atoms
O  -0.116392 0.223073 1.335709
O  0.232272 -0.201018 -0.832973
O  -3.626976 2.083283 -1.255111
C  2.718907 -1.729507 0.417671
C  3.150753 -0.480315 -0.268589
C  2.02388 -0.411596 0.743252
C  3.562116 -2.295871 1.53405
C  2.009543 -2.791449 -0.386382
C  4.449625 0.184688 0.010611
C  0.648828 -0.128637 0.298631
C  4.691848 1.485451 -0.171058
C  -1.499826 0.507127 1.133906
C  3.656392 2.456745 -0.647803
C  6.043041 2.073658 0.098368
C  -1.816682 1.764806 0.330858
C  -2.280184 -0.598252 0.464423
C  -3.141622 -0.108131 -0.441207
C  -2.963816 1.343225 -0.559383
C  -2.129052 -2.004065 0.911824
C  -4.200276 -0.82491 -1.216875
C  -5.524337 -0.723529 -0.514656
C  -6.566262 -0.031652 -0.958391
H  2.80747 -0.399396 -1.297312
H  2.27275 -0.001809 1.715694
H  4.355539 -2.932707 1.137227
H  4.029392 -1.522608 2.143772
H  2.950424 -2.909893 2.197759
H  1.315957 -3.361869 0.235092
H  1.453995 -2.389868 -1.230998
H  2.741629 -3.49559 -0.786663
H  5.261589 -0.44811 0.358275
H  -1.873907 0.612251 2.155191
H  2.690144 1.996265 -0.84841
H  3.985653 2.953885 -1.564024
H  3.501774 3.248151 0.090804
H  5.985096 2.86202 0.853759
H  6.45573 2.538955 -0.800663
H  6.755814 1.326301 0.447228
H  -0.980098 2.096805 -0.286309
H  -2.104844 2.60633 0.961475
H  -1.094087 -2.345256 0.834971
H  -2.408929 -2.096921 1.965076
H  -2.750013 -2.688839 0.337085
H  -3.927839 -1.876099 -1.338712
H  -4.275303 -0.397492 -2.219527
H  -5.594578 -1.250216 0.433283
H  -7.493315 0.010363 -0.400388
H  -6.53656 0.513734 -1.894889
elementType: O C H
totalener: -965.42544291 hartree
nucrepener: 1819.86052261 hartree
electener: -2785.28596552 hartree
oneelecener: -4926.35292631 hartree
twoeener: 2141.06696079 hartree
cpcmener: -0.03131377 hartree
kineticenergy: 960.98900704 hartree
xcener: -95.138086022563 hartree
chargesum: -0.0000000
charge: -0.296427 -0.466587 -0.452954 0.162632 -0.036666 -0.101431 -0.292419 -0.288114 -0.285960 0.370789 -0.013294 0.284988 -0.241924 -0.228824 -0.151132 -0.001845 -0.114927 0.278181 -0.252442 -0.119259 -0.174874 -0.277710 0.103840 0.090243 0.099961 0.092358 0.097242 0.093747 0.097041 0.101802 0.123378 0.117908 0.078317 0.100444 0.097127 0.094363 0.095184 0.088645 0.112808 0.104863 0.110976 0.114101 0.101808 0.109253 0.096087 0.139179 0.127641 0.111884
qa: -0.2964 -0.4666 -0.4530 0.1626 -0.0367 -0.1014 -0.2924 -0.2881 -0.2860 0.3708 -0.0133 0.2850 -0.2419 -0.2288 -0.1511 -0.0018 -0.1149 0.2782 -0.2524 -0.1193 -0.1749 -0.2777 0.1038 0.0902 0.1000 0.0924 0.0972 0.0937 0.0970 0.1018 0.1234 0.1179 0.0783 0.1004 0.0971 0.0944 0.0952 0.0886 0.1128 0.1049 0.1110 0.1141 0.1018 0.1093 0.0961 0.1392 0.1276 0.1119
va: 2.1275 2.0415 2.0480 3.6938 3.8376 3.8057 3.9108 3.8870 3.8857 4.1887 3.7078 3.7799 3.9397 3.9302 3.8825 3.6490 3.4641 4.0897 3.9539 3.8742 3.7912 3.9534 1.0249 1.0349 0.9992 1.0016 1.0028 1.0010 1.0164 1.0029 1.0028 0.9918 1.0169 0.9992 0.9983 0.9965 0.9960 1.0066 1.0246 1.0247 0.9985 0.9969 1.0041 1.0059 1.0211 1.0005 1.0032 1.0136
dispcorr: -0.023766506 hartree
energy: -965.449209414950
dipole: 16.75058 -15.21016 1.54042 -6.74483 5.34412 -1.40071 2.94573 -0.87965 2.06608
magnitude: 2.93318 au
magnitude: 7.45555 debye
