program: Orca
programVersion: 5.0.2
elementType: O O O C C C C C C C C C C C C C C C C C C C H H H H H H H H H H H H H H H H H H H H H H H H H H
charge: 0
multiplicity: 1
keywords: wb97x-d3
keywords: def2-TZVPP
keywords: def2/J RIJCOSX
keywords: DEFGRID2
keywords: scfconv7
keywords: smallprint printgap noloewdin
keywords: NOSOSCF
formula: C19H26O3
InChI: InChI=1/C19H26O3/c1-7-8-13-12(4)16(10-15(13)20)22-18(21)17-14(9-11(2)3)19(17,5)6/h7,9,14,16-17H,1,8,10H2,2-6H3
48 atoms
O  -0.099619 0.295507 0.748587
O  0.359949 -0.201513 2.882094
O  -3.629225 2.323817 -1.297882
C  2.166704 -1.743342 0.16998
C  2.545728 -0.331159 -0.138333
C  1.985221 -0.672455 1.234739
C  3.23453 -2.76768 0.471648
C  0.976304 -2.340587 -0.541943
C  3.941804 0.135531 -0.284958
C  0.679676 -0.182908 1.716024
C  4.302808 1.36743 -0.658282
C  -1.395966 0.819482 1.056693
C  3.335049 2.478007 -0.937577
C  5.744987 1.732222 -0.83872
C  -1.700813 1.992133 0.135882
C  -2.458766 -0.207174 0.749653
C  -3.362581 0.257124 -0.126945
C  -2.997767 1.617145 -0.541691
C  -2.433794 -1.543969 1.38969
C  -4.546869 -0.450986 -0.686469
C  -4.245103 -1.2963 -1.890894
C  -3.04952 -1.52396 -2.420547
H  1.835088 0.173867 -0.783034
H  2.706159 -0.732147 2.04263
H  4.059328 -2.364914 1.058876
H  2.810778 -3.598648 1.038996
H  3.649997 -3.177104 -0.451544
H  0.256536 -1.597005 -0.878092
H  1.316337 -2.880629 -1.42811
H  0.454744 -3.058341 0.094735
H  4.728325 -0.587376 -0.090258
H  -1.438755 1.108228 2.108908
H  2.319024 2.264939 -0.611751
H  3.301258 2.709687 -2.004939
H  3.652612 3.394466 -0.435807
H  6.410313 0.886402 -0.664891
H  6.036922 2.537359 -0.159246
H  5.930851 2.102481 -1.850869
H  -0.92124 2.128095 -0.617327
H  -1.802778 2.937831 0.669607
H  -3.337194 -2.114067 1.183842
H  -1.58726 -2.131324 1.027875
H  -2.31808 -1.458675 2.470905
H  -5.317063 0.277455 -0.957404
H  -5.009438 -1.085483 0.075667
H  -5.116155 -1.757103 -2.347137
H  -2.943161 -2.151605 -3.296158
H  -2.138508 -1.091521 -2.023832
elementType: O C H
totalener: -965.42587930 hartree
nucrepener: 1846.76034948 hartree
electener: -2812.18622878 hartree
oneelecener: -4979.23515336 hartree
twoeener: 2167.04892458 hartree
cpcmener: -0.03043285 hartree
kineticenergy: 960.99952892 hartree
xcener: -95.141229058035 hartree
chargesum: -0.0000000
charge: -0.277284 -0.465954 -0.444752 0.142501 -0.002688 -0.078551 -0.301150 -0.287815 -0.289960 0.387971 -0.009154 0.230540 -0.260186 -0.231512 -0.138670 -0.065131 -0.083648 0.293720 -0.249238 -0.070914 -0.183784 -0.270770 0.103209 0.093150 0.088685 0.099753 0.101687 0.077548 0.103910 0.103946 0.118046 0.109950 0.081308 0.101553 0.094527 0.087905 0.094284 0.093346 0.098884 0.102105 0.105149 0.118051 0.121191 0.091475 0.102475 0.130786 0.129492 0.104013
qa: -0.2773 -0.4660 -0.4448 0.1425 -0.0027 -0.0786 -0.3012 -0.2878 -0.2900 0.3880 -0.0092 0.2305 -0.2602 -0.2315 -0.1387 -0.0651 -0.0836 0.2937 -0.2492 -0.0709 -0.1838 -0.2708 0.1032 0.0931 0.0887 0.0998 0.1017 0.0775 0.1039 0.1039 0.1180 0.1100 0.0813 0.1016 0.0945 0.0879 0.0943 0.0933 0.0989 0.1021 0.1051 0.1181 0.1212 0.0915 0.1025 0.1308 0.1295 0.1040
va: 2.1044 2.0362 2.0624 3.7346 3.7657 3.8261 3.9199 3.9035 3.8963 4.1996 3.7193 3.7375 3.9494 3.9334 3.9017 3.7309 3.4204 4.0733 3.9307 3.8344 3.8498 3.8984 1.0136 1.0291 1.0039 1.0010 0.9994 1.0063 1.0045 0.9953 1.0101 1.0308 1.0123 0.9960 0.9988 1.0079 0.9963 0.9947 1.0270 1.0229 1.0047 0.9937 1.0074 1.0196 1.0010 1.0021 1.0054 1.0204
dispcorr: -0.024908877 hartree
energy: -965.450788178255
dipole: 16.68980 -15.73811 0.95169 -8.44459 7.23349 -1.21110 -6.75241 6.76200 0.00960
magnitude: 1.54031 au
magnitude: 3.91515 debye
