program: Orca
programVersion: 5.0.2
elementType: O O O C C C C C C C C C C C C C C C C C C C H H H H H H H H H H H H H H H H H H H H H H H H H H
charge: 0
multiplicity: 1
keywords: wb97x-d3
keywords: def2-TZVPP
keywords: def2/J RIJCOSX
keywords: DEFGRID2
keywords: scfconv7
keywords: smallprint printgap noloewdin
keywords: NOSOSCF
formula: C19H26O3
InChI: InChI=1/C19H26O3/c1-7-8-13-12(4)16(10-15(13)20)22-18(21)17-14(9-11(2)3)19(17,5)6/h7,9,14,16-17H,1,8,10H2,2-6H3
48 atoms
O  0.116907 0.102616 0.373559
O  0.431276 -0.261734 2.558515
O  -3.567486 1.901225 -1.763695
C  2.614258 -1.771111 0.136759
C  2.900359 -0.35744 -0.242771
C  2.235227 -0.647023 1.090389
C  3.739751 -2.658154 0.612702
C  1.549024 -2.52548 -0.621234
C  4.272087 0.211176 -0.282539
C  0.850812 -0.262817 1.424301
C  4.54845 1.516508 -0.218101
C  -1.22236 0.568661 0.569953
C  3.495654 2.569963 -0.05677
C  5.953065 2.027249 -0.316877
C  -1.54468 1.654968 -0.445157
C  -2.23414 -0.522986 0.311604
C  -3.16477 -0.131988 -0.574069
C  -2.869105 1.231375 -1.033408
C  -2.171143 -1.805392 1.052948
C  -4.392419 -0.854333 -1.029133
C  -5.593838 -0.399363 -0.251743
C  -6.618856 0.26834 -0.765406
H  2.224957 0.044995 -0.992456
H  2.876562 -0.579591 1.962401
H  4.26618 -3.10439 -0.23379
H  4.47241 -2.123031 1.216833
H  3.348235 -3.474485 1.222836
H  0.802657 -1.87603 -1.074582
H  2.010683 -3.096738 -1.429552
H  1.033035 -3.237988 0.025865
H  5.095905 -0.486461 -0.404108
H  -1.335756 0.937112 1.592184
H  3.41059 3.174621 -0.964653
H  3.759698 3.261389 0.747643
H  2.50884 2.164265 0.163609
H  6.058736 2.727747 -1.149775
H  6.675434 1.223704 -0.460825
H  6.234912 2.577529 0.584929
H  -0.797214 1.68901 -1.241985
H  -1.603863 2.652283 -0.008785
H  -2.991778 -2.471759 0.795088
H  -1.236587 -2.334884 0.854165
H  -2.206388 -1.624764 2.129485
H  -4.260365 -1.931495 -0.903298
H  -4.549441 -0.676956 -2.095531
H  -5.586371 -0.636485 0.808522
H  -7.456557 0.574323 -0.151344
H  -6.663354 0.531042 -1.816172
elementType: O C H
totalener: -965.42576983 hartree
nucrepener: 1814.21075286 hartree
electener: -2779.63652269 hartree
oneelecener: -4914.27878038 hartree
twoeener: 2134.64225769 hartree
cpcmener: -0.03052038 hartree
kineticenergy: 960.98406606 hartree
xcener: -95.135327079555 hartree
chargesum: -0.0000000
charge: -0.277874 -0.465607 -0.447439 0.163316 -0.007105 -0.120150 -0.298254 -0.298258 -0.303787 0.401582 -0.008834 0.206024 -0.244701 -0.226749 -0.131216 -0.028725 -0.067018 0.281203 -0.251751 -0.112050 -0.176778 -0.276038 0.107229 0.092467 0.099455 0.091170 0.098980 0.092316 0.101463 0.102933 0.122852 0.108755 0.102620 0.094199 0.075949 0.093874 0.088455 0.094930 0.101451 0.098450 0.102813 0.113769 0.117081 0.109446 0.098611 0.140802 0.128186 0.111958
qa: -0.2779 -0.4656 -0.4474 0.1633 -0.0071 -0.1201 -0.2983 -0.2983 -0.3038 0.4016 -0.0088 0.2060 -0.2447 -0.2267 -0.1312 -0.0287 -0.0670 0.2812 -0.2518 -0.1120 -0.1768 -0.2760 0.1072 0.0925 0.0995 0.0912 0.0990 0.0923 0.1015 0.1029 0.1229 0.1088 0.1026 0.0942 0.0759 0.0939 0.0885 0.0949 0.1015 0.0984 0.1028 0.1138 0.1171 0.1094 0.0986 0.1408 0.1282 0.1120
va: 2.0985 2.0333 2.0536 3.6875 3.7934 3.8537 3.9141 3.8872 3.8737 4.1506 3.7057 3.7932 3.9451 3.9298 3.9230 3.7269 3.4240 4.0913 3.9447 3.8731 3.7834 3.9574 1.0179 1.0298 0.9990 1.0020 1.0020 1.0119 1.0041 0.9964 1.0038 1.0306 0.9977 1.0001 1.0159 0.9955 1.0069 0.9968 1.0258 1.0249 1.0065 0.9949 1.0034 1.0045 1.0181 1.0004 1.0032 1.0129
dispcorr: -0.023944054 hartree
energy: -965.449713886949
dipole: 15.36616 -13.92743 1.43872 -5.61767 4.41844 -1.19923 -1.57880 1.64051 0.06170
magnitude: 1.87400 au
magnitude: 4.76333 debye
