program: Orca
programVersion: 5.0.2
elementType: O O O C C C C C C C C C C C C C C C C C C C H H H H H H H H H H H H H H H H H H H H H H H H H H
charge: 0
multiplicity: 1
keywords: wb97x-d3
keywords: def2-TZVPP
keywords: def2/J RIJCOSX
keywords: DEFGRID2
keywords: scfconv7
keywords: smallprint printgap noloewdin
keywords: NOSOSCF
formula: C19H26O3
InChI: InChI=1/C19H26O3/c1-7-8-13-12(4)16(10-15(13)20)22-18(21)17-14(9-11(2)3)19(17,5)6/h7,9,14,16-17H,1,8,10H2,2-6H3
48 atoms
O  -0.165438 0.383664 1.482116
O  -0.07005 -0.155137 -0.686697
O  -3.744616 2.414903 -0.880036
C  2.424707 -1.810063 0.349745
C  2.857238 -0.60441 -0.40935
C  1.849087 -0.445718 0.712095
C  3.350362 -2.404383 1.383612
C  1.56863 -2.842011 -0.341786
C  4.21357 -0.011784 -0.277421
C  0.460275 -0.074962 0.396547
C  4.489992 1.285868 -0.430902
C  -1.528875 0.796291 1.401324
C  3.4463 2.318994 -0.72556
C  5.887953 1.809259 -0.306049
C  -1.819718 2.024928 0.545105
C  -2.482361 -0.261653 0.907798
C  -3.413675 0.258458 0.092513
C  -3.094192 1.662475 -0.184792
C  -2.376373 -1.661577 1.382072
C  -4.602044 -0.421603 -0.497743
C  -4.342577 -1.176417 -1.768485
C  -3.175175 -1.318028 -2.383181
H  2.412752 -0.520128 -1.398522
H  2.223045 -0.031554 1.641652
H  4.054878 -3.097077 0.91815
H  3.928838 -1.649607 1.916572
H  2.781209 -2.966575 2.126543
H  0.907841 -3.345864 0.367122
H  0.955624 -2.42677 -1.139043
H  2.207825 -3.605706 -0.78999
H  5.031815 -0.694982 -0.066563
H  -1.774829 1.003307 2.445831
H  3.381362 3.044239 0.090554
H  2.452716 1.900669 -0.878244
H  3.70847 2.888888 -1.620736
H  6.603832 1.021511 -0.070985
H  5.952859 2.568802 0.477771
H  6.210779 2.294041 -1.231281
H  -1.031272 2.238177 -0.178775
H  -1.961416 2.928709 1.138876
H  -1.572379 -2.18413 0.856034
H  -2.139197 -1.705535 2.446547
H  -3.29317 -2.222808 1.206747
H  -5.385957 0.31833 -0.688343
H  -5.037704 -1.114373 0.229283
H  -5.223196 -1.64236 -2.201134
H  -3.100462 -1.887362 -3.301265
H  -2.258521 -0.879212 -2.009792
elementType: O C H
totalener: -965.42574514 hartree
nucrepener: 1853.24996600 hartree
electener: -2818.67571114 hartree
oneelecener: -4993.20505199 hartree
twoeener: 2174.52934085 hartree
cpcmener: -0.02957450 hartree
kineticenergy: 960.99377816 hartree
xcener: -95.141161607536 hartree
chargesum: -0.0000000
charge: -0.295794 -0.476121 -0.451839 0.161611 -0.030026 -0.103883 -0.290832 -0.289663 -0.293942 0.386770 -0.010345 0.298197 -0.240642 -0.228173 -0.160272 -0.015682 -0.133744 0.295659 -0.262766 -0.090229 -0.184313 -0.278398 0.104543 0.089457 0.099727 0.092427 0.097373 0.095463 0.096637 0.101524 0.122449 0.118408 0.098701 0.078071 0.100219 0.088909 0.093521 0.095977 0.113515 0.104500 0.114367 0.118670 0.107491 0.090270 0.102010 0.130120 0.126965 0.113114
qa: -0.2958 -0.4761 -0.4518 0.1616 -0.0300 -0.1039 -0.2908 -0.2897 -0.2939 0.3868 -0.0103 0.2982 -0.2406 -0.2282 -0.1603 -0.0157 -0.1337 0.2957 -0.2628 -0.0902 -0.1843 -0.2784 0.1045 0.0895 0.0997 0.0924 0.0974 0.0955 0.0966 0.1015 0.1224 0.1184 0.0987 0.0781 0.1002 0.0889 0.0935 0.0960 0.1135 0.1045 0.1144 0.1187 0.1075 0.0903 0.1020 0.1301 0.1270 0.1131
va: 2.1313 2.0203 2.0543 3.6877 3.8257 3.8174 3.9077 3.8915 3.8877 4.1394 3.7045 3.7479 3.9377 3.9308 3.8679 3.6703 3.4447 4.0613 3.9411 3.8408 3.8423 3.8927 1.0264 1.0336 0.9994 1.0020 1.0028 1.0001 1.0148 1.0029 1.0036 0.9927 0.9980 1.0178 1.0001 1.0063 0.9964 0.9963 1.0251 1.0252 0.9951 1.0013 1.0021 1.0189 1.0006 1.0010 1.0056 1.0241
dispcorr: -0.025062256 hartree
energy: -965.450807394004
dipole: 18.64796 -17.25575 1.39222 -8.95465 7.64769 -1.30696 0.50395 1.65775 2.16169
magnitude: 2.88432 au
magnitude: 7.33137 debye
