program: Orca
programVersion: 5.0.2
elementType: O O O C C C C C C C C C C C C C C C C C C C H H H H H H H H H H H H H H H H H H H H H H H H H H
charge: 0
multiplicity: 1
keywords: wb97x-d3
keywords: def2-TZVPP
keywords: def2/J RIJCOSX
keywords: DEFGRID2
keywords: scfconv7
keywords: smallprint printgap noloewdin
keywords: NOSOSCF
formula: C19H26O3
InChI: InChI=1/C19H26O3/c1-7-8-13-12(4)16(10-15(13)20)22-18(21)17-14(9-11(2)3)19(17,5)6/h7,9,14,16-17H,1,8,10H2,2-6H3
48 atoms
O  -0.404508 0.078391 0.953759
O  0.485965 -1.965737 1.17191
O  -4.797991 1.425635 0.87048
C  3.032145 -0.317235 2.008937
C  3.159742 -0.782626 0.600762
C  1.902814 -0.043753 1.023681
C  3.801592 0.904954 2.448996
C  2.860539 -1.336555 3.108088
C  4.100632 -0.15724 -0.36519
C  0.622397 -0.769519 1.065849
C  3.858759 0.011247 -1.667926
C  -1.743689 -0.426694 0.958519
C  2.574832 -0.392987 -2.326143
C  4.87203 0.636623 -2.577429
C  -2.668832 0.563919 1.650238
C  -2.27292 -0.534529 -0.450362
C  -3.438238 0.115094 -0.596192
C  -3.787131 0.789992 0.659399
C  -1.541025 -1.301285 -1.486709
C  -4.281451 0.218897 -1.820542
C  -3.827309 1.260119 -2.803671
C  -2.737648 2.012984 -2.714974
H  3.005879 -1.851512 0.468995
H  1.822617 0.987934 0.699748
H  4.817819 0.635235 2.744275
H  3.873148 1.662056 1.667875
H  3.322211 1.369211 3.313201
H  3.837617 -1.590274 3.526233
H  2.250315 -0.939638 3.922909
H  2.404735 -2.263715 2.766565
H  5.062704 0.161223 0.028112
H  -1.770781 -1.404904 1.44344
H  2.035162 0.484131 -2.695385
H  1.906424 -0.94377 -1.666341
H  2.770649 -1.021798 -3.198821
H  4.457539 1.514377 -3.081176
H  5.17431 -0.056926 -3.36685
H  5.769556 0.948564 -2.042831
H  -2.16384 1.513703 1.841722
H  -3.055293 0.201184 2.603058
H  -1.317954 -2.314048 -1.141403
H  -2.101898 -1.369795 -2.417905
H  -0.580957 -0.8267 -1.715436
H  -5.315131 0.436978 -1.534933
H  -4.326388 -0.746001 -2.334941
H  -4.476536 1.378125 -3.666957
H  -2.5000 2.732858 -3.488768
H  -2.04455 1.95038 -1.883783
elementType: O C H
totalener: -965.42812352 hartree
nucrepener: 1826.95146107 hartree
electener: -2792.37958460 hartree
oneelecener: -4939.91024621 hartree
twoeener: 2147.53066161 hartree
cpcmener: -0.02805440 hartree
kineticenergy: 960.97380797 hartree
xcener: -95.135046459681 hartree
chargesum: -0.0000000
charge: -0.291321 -0.471247 -0.447208 0.149540 -0.011447 -0.106937 -0.287795 -0.281696 -0.300677 0.370285 -0.008110 0.271250 -0.232227 -0.229314 -0.144227 -0.052471 -0.089900 0.299002 -0.259310 -0.071110 -0.186589 -0.273270 0.104003 0.092447 0.098776 0.093135 0.097100 0.094984 0.099418 0.093599 0.121015 0.106957 0.102727 0.068390 0.101273 0.094038 0.096422 0.089404 0.100001 0.099084 0.122697 0.106371 0.112517 0.090440 0.102246 0.130764 0.129515 0.107452
qa: -0.2913 -0.4712 -0.4472 0.1495 -0.0114 -0.1069 -0.2878 -0.2817 -0.3007 0.3703 -0.0081 0.2713 -0.2322 -0.2293 -0.1442 -0.0525 -0.0899 0.2990 -0.2593 -0.0711 -0.1866 -0.2733 0.1040 0.0924 0.0988 0.0931 0.0971 0.0950 0.0994 0.0936 0.1210 0.1070 0.1027 0.0684 0.1013 0.0940 0.0964 0.0894 0.1000 0.0991 0.1227 0.1064 0.1125 0.0904 0.1022 0.1308 0.1295 0.1075
va: 2.1235 2.0298 2.0597 3.6958 3.8069 3.8121 3.9098 3.8932 3.8951 4.1807 3.7069 3.7254 3.9350 3.9320 3.8989 3.7146 3.4368 4.0529 3.9320 3.8353 3.8430 3.9017 1.0267 1.0320 0.9996 1.0019 1.0031 1.0011 0.9990 1.0183 1.0039 1.0304 0.9969 1.0135 1.0010 0.9964 0.9961 1.0063 1.0293 1.0247 1.0067 1.0054 0.9948 1.0221 1.0000 1.0025 1.0048 1.0200
dispcorr: -0.024110953 hartree
energy: -965.452234476379
dipole: 21.25516 -19.55722 1.69794 0.70616 -1.02249 -0.31633 -8.53110 7.69997 -0.83113
magnitude: 1.91673 au
magnitude: 4.87194 debye
