program: Orca
programVersion: 5.0.2
elementType: O O O C C C C C C C C C C C C C C C C C C C H H H H H H H H H H H H H H H H H H H H H H H H H H
charge: 0
multiplicity: 1
keywords: wb97x-d3
keywords: def2-TZVPP
keywords: def2/J RIJCOSX
keywords: DEFGRID2
keywords: scfconv7
keywords: smallprint printgap noloewdin
keywords: NOSOSCF
formula: C19H26O3
InChI: InChI=1/C19H26O3/c1-7-8-13-12(4)16(10-15(13)20)22-18(21)17-14(9-11(2)3)19(17,5)6/h7,9,14,16-17H,1,8,10H2,2-6H3
48 atoms
O  -0.608155 0.201745 0.801306
O  0.457979 -1.755927 1.028003
O  -5.027845 1.343919 1.093253
C  2.897173 0.184698 1.527005
C  2.97512 -0.403383 0.15019
C  1.691206 0.252463 0.602488
C  3.589709 1.49796 1.796451
C  2.905042 -0.7450 2.7147
C  3.761593 0.229389 -0.935532
C  0.484992 -0.563786 0.834735
C  4.916137 -0.230103 -1.426433
C  -1.896671 -0.382827 1.022442
C  5.604488 -1.466031 -0.933567
C  5.621527 0.484319 -2.539008
C  -2.799157 0.623093 1.723112
C  -2.579791 -0.66938 -0.292696
C  -3.782624 -0.078901 -0.368892
C  -4.021178 0.717121 0.840477
C  -1.937588 -1.523137 -1.320533
C  -4.758396 -0.129557 -1.49286
C  -4.479383 0.845843 -2.600135
C  -3.43293 1.656161 -2.698001
H  2.937058 -1.488507 0.130879
H  1.489237 1.238943 0.198503
H  4.651217 1.334766 1.995487
H  3.515105 2.194749 0.961943
H  3.160828 1.986697 2.673583
H  2.324073 -0.333189 3.542894
H  2.513925 -1.734631 2.489255
H  3.929988 -0.874891 3.068493
H  3.356367 1.144425 -1.358609
H  -1.792183 -1.302761 1.602042
H  6.626529 -1.235557 -0.62166
H  5.688375 -2.209311 -1.731131
H  5.103452 -1.937601 -0.089742
H  5.75372 -0.169312 -3.405528
H  6.623853 0.79568 -2.232693
H  5.079937 1.371366 -2.867959
H  -2.327292 1.60601 1.791933
H  -3.071494 0.322634 2.735498
H  -1.032526 -1.049162 -1.708661
H  -1.635183 -2.483092 -0.898061
H  -2.596511 -1.710733 -2.166248
H  -5.766971 0.056592 -1.111638
H  -4.796675 -1.136395 -1.920172
H  -5.225829 0.856175 -3.388885
H  -3.324782 2.31936 -3.546817
H  -2.65087 1.698306 -1.949119
elementType: O C H
totalener: -965.42924351 hartree
nucrepener: 1789.98766917 hartree
electener: -2755.41691268 hartree
oneelecener: -4866.14936327 hartree
twoeener: 2110.73245059 hartree
cpcmener: -0.02876159 hartree
kineticenergy: 960.99160475 hartree
xcener: -95.137889961467 hartree
chargesum: 0.0000000
charge: -0.291675 -0.469570 -0.446663 0.148306 0.001242 -0.134943 -0.264617 -0.294737 -0.270829 0.394597 -0.030020 0.275784 -0.251093 -0.227902 -0.143285 -0.058481 -0.096701 0.297564 -0.248699 -0.069247 -0.186960 -0.272972 0.097544 0.089374 0.096106 0.089768 0.097990 0.100439 0.093733 0.096015 0.119526 0.106014 0.094520 0.098051 0.087592 0.093993 0.093383 0.088688 0.099689 0.099498 0.113349 0.121455 0.103071 0.091321 0.102004 0.130309 0.129900 0.107569
qa: -0.2917 -0.4696 -0.4467 0.1483 0.0012 -0.1349 -0.2646 -0.2947 -0.2708 0.3946 -0.0300 0.2758 -0.2511 -0.2279 -0.1433 -0.0585 -0.0967 0.2976 -0.2487 -0.0692 -0.1870 -0.2730 0.0975 0.0894 0.0961 0.0898 0.0980 0.1004 0.0937 0.0960 0.1195 0.1060 0.0945 0.0981 0.0876 0.0940 0.0934 0.0887 0.0997 0.0995 0.1133 0.1215 0.1031 0.0913 0.1020 0.1303 0.1299 0.1076
va: 2.1289 2.0350 2.0599 3.6736 3.7725 3.9144 3.9049 3.9044 3.8765 4.1843 3.7081 3.7098 3.9439 3.9267 3.9016 3.7470 3.4439 4.0552 3.9336 3.8336 3.8470 3.9012 1.0265 1.0389 1.0030 1.0032 1.0028 0.9992 1.0184 1.0009 1.0079 1.0299 0.9977 0.9975 1.0084 0.9953 0.9965 1.0082 1.0301 1.0240 0.9971 1.0059 1.0043 1.0214 0.9995 1.0026 1.0048 1.0207
dispcorr: -0.022798338 hartree
energy: -965.452041850283
dipole: 26.44369 -24.59767 1.84602 -0.65491 0.21718 -0.43773 -7.12697 6.45635 -0.67062
magnitude: 2.01224 au
magnitude: 5.11472 debye
