program: Orca
programVersion: 5.0.2
elementType: O O O C C C C C C C C C C C C C C C C C C C H H H H H H H H H H H H H H H H H H H H H H H H H H
charge: 0
multiplicity: 1
keywords: wb97x-d3
keywords: def2-TZVPP
keywords: def2/J RIJCOSX
keywords: DEFGRID2
keywords: scfconv7
keywords: smallprint printgap noloewdin
keywords: NOSOSCF
formula: C19H26O3
InChI: InChI=1/C19H26O3/c1-7-8-13-12(4)16(10-15(13)20)22-18(21)17-14(9-11(2)3)19(17,5)6/h7,9,14,16-17H,1,8,10H2,2-6H3
48 atoms
O  -0.425492 0.054063 0.946573
O  0.568697 -1.949473 1.107376
O  -4.97591 0.95061 0.95255
C  3.00552 -0.15855 2.037937
C  3.188239 -0.636227 0.641219
C  1.885225 0.045967 1.025768
C  3.697538 1.107999 2.480604
C  2.860645 -1.172028 3.145554
C  4.110502 0.007214 -0.327868
C  0.644582 -0.743047 1.038918
C  3.987086 -0.078633 -1.655205
C  -1.730356 -0.523222 0.852642
C  2.863198 -0.800839 -2.332403
C  4.985154 0.553343 -2.575856
C  -2.741108 0.298221 1.637804
C  -2.220681 -0.480858 -0.572026
C  -3.454264 0.04338 -0.655139
C  -3.884633 0.492709 0.671914
C  -1.384194 -0.999577 -1.679681
C  -4.297064 0.213657 -1.871449
C  -4.001419 1.45448 -2.663572
C  -3.027954 2.327161 -2.433161
H  3.083471 -1.71198 0.524697
H  1.761989 1.069598 0.691543
H  3.740152 1.860647 1.693579
H  3.175676 1.549851 3.331093
H  4.720987 0.896122 2.79614
H  2.459496 -2.12434 2.806313
H  3.839325 -1.371272 3.586098
H  2.214831 -0.794545 3.940448
H  4.954429 0.55676 0.079207
H  -1.706561 -1.557022 1.202779
H  3.247042 -1.616154 -2.951217
H  2.32949 -0.128925 -3.009514
H  2.13697 -1.22249 -1.638951
H  4.503605 1.275124 -3.240345
H  5.450901 -0.195779 -3.221328
H  5.776462 1.068916 -2.032245
H  -2.333857 1.278313 1.898751
H  -3.070318 -0.178613 2.560669
H  -0.499353 -0.372455 -1.816276
H  -1.025233 -2.006819 -1.460296
H  -1.923047 -1.021285 -2.624873
H  -5.353414 0.224969 -1.587846
H  -4.188815 -0.651563 -2.532422
H  -4.663784 1.618142 -3.50792
H  -2.895259 3.188791 -3.074492
H  -2.329954 2.223655 -1.610895
elementType: O C H
totalener: -965.41742997 hartree
nucrepener: 1819.36976299 hartree
electener: -2784.78719297 hartree
oneelecener: -4924.72048469 hartree
twoeener: 2139.93329173 hartree
cpcmener: -0.03503772 hartree
kineticenergy: 960.99605510 hartree
xcener: -95.142274104794 hartree
chargesum: -0.0000000
charge: -0.297990 -0.500282 -0.485097 0.157689 -0.027220 -0.093960 -0.292805 -0.275535 -0.295693 0.393240 -0.005503 0.271285 -0.247119 -0.231524 -0.144182 -0.034358 -0.100972 0.326918 -0.256622 -0.074451 -0.189401 -0.281957 0.100907 0.092903 0.092961 0.098358 0.100904 0.090461 0.097027 0.100881 0.125332 0.106706 0.103852 0.099255 0.071741 0.096038 0.095820 0.090013 0.103475 0.100286 0.114473 0.121925 0.108274 0.089467 0.105362 0.134303 0.133256 0.111562
qa: -0.2980 -0.5003 -0.4851 0.1577 -0.0272 -0.0940 -0.2928 -0.2755 -0.2957 0.3932 -0.0055 0.2713 -0.2471 -0.2315 -0.1442 -0.0344 -0.1010 0.3269 -0.2566 -0.0745 -0.1894 -0.2820 0.1009 0.0929 0.0930 0.0984 0.1009 0.0905 0.0970 0.1009 0.1253 0.1067 0.1039 0.0993 0.0717 0.0960 0.0958 0.0900 0.1035 0.1003 0.1145 0.1219 0.1083 0.0895 0.1054 0.1343 0.1333 0.1116
va: 2.1250 1.9948 2.0120 3.7045 3.8150 3.8052 3.9131 3.8888 3.8905 4.1529 3.6933 3.7285 3.9449 3.9287 3.9126 3.7096 3.4591 4.0151 3.9256 3.8341 3.8342 3.8983 1.0275 1.0334 1.0009 1.0027 0.9987 1.0174 1.0007 0.9993 1.0035 1.0327 0.9999 0.9973 1.0145 0.9964 0.9956 1.0062 1.0270 1.0250 0.9956 1.0057 1.0050 1.0214 0.9994 1.0019 1.0041 1.0182
dispcorr: -0.023819981 hartree
energy: -965.441249955102
dipole: 21.87419 -19.88186 1.99234 1.87582 -1.93523 -0.05941 -8.58314 7.54011 -1.04303
magnitude: 2.24963 au
magnitude: 5.71811 debye
