program: Orca
programVersion: 5.0.2
elementType: O O O C C C C C C C C C C C C C C C C C C C H H H H H H H H H H H H H H H H H H H H H H H H H H
charge: 0
multiplicity: 1
keywords: wb97x-d3
keywords: def2-TZVPP
keywords: def2/J RIJCOSX
keywords: DEFGRID2
keywords: scfconv7
keywords: smallprint printgap noloewdin
keywords: NOSOSCF
formula: C19H26O3
InChI: InChI=1/C19H26O3/c1-7-8-13-12(4)16(10-15(13)20)22-18(21)17-14(9-11(2)3)19(17,5)6/h7,9,14,16-17H,1,8,10H2,2-6H3
48 atoms
O  -0.421108 0.067385 0.952963
O  0.561073 -1.814597 0.23078
O  -4.924851 1.002194 1.430295
C  3.013941 -0.616406 1.802317
C  3.187586 -0.38933 0.333052
C  1.887955 0.022131 1.005073
C  3.708252 0.292901 2.787255
C  2.900271 -2.036675 2.298915
C  4.068757 0.65204 -0.228994
C  0.643161 -0.694765 0.682933
C  4.871814 0.490899 -1.285424
C  -1.739446 -0.433119 0.707116
C  4.988664 -0.797937 -2.051512
C  5.704111 1.624143 -1.803093
C  -2.70202 0.084359 1.765825
C  -2.2779 0.09357 -0.600603
C  -3.476453 0.678638 -0.442158
C  -3.857465 0.64188 0.972195
C  -1.538311 -0.112758 -1.867636
C  -4.375933 1.233814 -1.501767
C  -5.179675 0.147674 -2.152814
C  -5.164601 -0.120127 -3.45256
H  3.101759 -1.292378 -0.262019
H  1.757968 1.083856 1.181998
H  3.713114 1.335891 2.473522
H  3.214788 0.245628 3.759518
H  4.74504 -0.0188 2.928192
H  3.889101 -2.396913 2.58908
H  2.25928 -2.095108 3.180732
H  2.512497 -2.725514 1.551701
H  4.041521 1.625313 0.251646
H  -1.726387 -1.524861 0.686165
H  4.199033 -0.884517 -2.801364
H  4.92789 -1.678992 -1.414561
H  5.936762 -0.8472 -2.587422
H  5.541854 2.545535 -1.244434
H  5.481299 1.82314 -2.854755
H  6.768782 1.381717 -1.756919
H  -2.253543 0.890505 2.351341
H  -3.031327 -0.684825 2.464084
H  -0.544595 0.33813 -1.822399
H  -1.392521 -1.179328 -2.05203
H  -2.060953 0.312139 -2.721867
H  -3.795108 1.769131 -2.254483
H  -5.051187 1.962952 -1.046155
H  -5.801852 -0.446524 -1.490445
H  -5.7570 -0.923541 -3.870422
H  -4.551967 0.445826 -4.144677
elementType: O C H
totalener: -965.41787560 hartree
nucrepener: 1772.19866836 hartree
electener: -2737.61654397 hartree
oneelecener: -4830.48833068 hartree
twoeener: 2092.87178672 hartree
cpcmener: -0.03461316 hartree
kineticenergy: 960.99340451 hartree
xcener: -95.139902784753 hartree
chargesum: -0.0000000
charge: -0.295720 -0.499774 -0.488868 0.107559 0.050702 -0.112660 -0.272589 -0.279214 -0.307137 0.414205 -0.016367 0.259738 -0.283374 -0.219881 -0.139803 -0.054875 -0.066667 0.326745 -0.242170 -0.104065 -0.182941 -0.289468 0.092769 0.088537 0.089895 0.097873 0.097811 0.097214 0.100110 0.090491 0.120754 0.106823 0.108097 0.098684 0.096363 0.086430 0.097763 0.093988 0.104509 0.099156 0.116629 0.117891 0.098524 0.105516 0.097854 0.144272 0.132741 0.115929
qa: -0.2957 -0.4998 -0.4889 0.1076 0.0507 -0.1127 -0.2726 -0.2792 -0.3071 0.4142 -0.0164 0.2597 -0.2834 -0.2199 -0.1398 -0.0549 -0.0667 0.3267 -0.2422 -0.1041 -0.1829 -0.2895 0.0928 0.0885 0.0899 0.0979 0.0978 0.0972 0.1001 0.0905 0.1208 0.1068 0.1081 0.0987 0.0964 0.0864 0.0978 0.0940 0.1045 0.0992 0.1166 0.1179 0.0985 0.1055 0.0979 0.1443 0.1327 0.1159
va: 2.1244 1.9978 2.0031 3.6889 3.7638 3.8793 3.9123 3.9072 3.9061 4.1470 3.7091 3.7406 3.9427 3.9236 3.9372 3.7936 3.4386 4.0266 3.9320 3.8649 3.7914 3.9432 1.0302 1.0381 1.0058 1.0017 1.0013 1.0000 0.9992 1.0188 1.0104 1.0301 0.9936 0.9994 1.0014 1.0097 0.9933 0.9945 1.0268 1.0244 1.0022 1.0019 1.0068 1.0037 1.0226 1.0044 1.0029 1.0090
dispcorr: -0.021865835 hartree
energy: -965.439741438098
dipole: 23.97103 -21.80540 2.16563 -0.59062 0.82313 0.23251 -8.02814 7.36603 -0.66212
magnitude: 2.27649 au
magnitude: 5.78639 debye
