program: Orca
programVersion: 5.0.2
elementType: O O O C C C C C C C C C C C C C C C C C C C H H H H H H H H H H H H H H H H H H H H H H H H H H
charge: 0
multiplicity: 1
keywords: wb97x-d3
keywords: def2-TZVPP
keywords: def2/J RIJCOSX
keywords: DEFGRID2
keywords: scfconv7
keywords: smallprint printgap noloewdin
keywords: NOSOSCF
formula: C19H26O3
InChI: InChI=1/C19H26O3/c1-7-8-13-12(4)16(10-15(13)20)22-18(21)17-14(9-11(2)3)19(17,5)6/h7,9,14,16-17H,1,8,10H2,2-6H3
48 atoms
O  -0.45135 0.077916 1.034703
O  0.570808 -1.915586 1.084882
O  -4.910236 1.145759 0.787499
C  3.043376 -0.237247 2.024199
C  3.139291 -0.494618 0.557932
C  1.857095 0.101344 1.136609
C  3.750507 0.953876 2.627076
C  2.993725 -1.416066 2.965394
C  3.97394 0.306768 -0.358481
C  0.629073 -0.705983 1.091402
C  4.270932 -0.009622 -1.623556
C  -1.748739 -0.515827 0.915861
C  3.7727 -1.229519 -2.336588
C  5.160818 0.871589 -2.446216
C  -2.780251 0.345344 1.62949
C  -2.190805 -0.542366 -0.527403
C  -3.394375 0.031956 -0.685509
C  -3.849352 0.584489 0.593368
C  -1.349419 -1.175439 -1.570303
C  -4.195043 0.194746 -1.936713
C  -3.912512 1.525801 -2.568293
C  -4.795606 2.509609 -2.683771
H  3.034975 -1.540888 0.291014
H  1.706091 1.161224 0.96778
H  4.807463 0.73206 2.785841
H  3.68436 1.848848 2.009845
H  3.314439 1.196148 3.597617
H  4.00232 -1.636601 3.319862
H  2.381995 -1.191652 3.84115
H  2.607744 -2.321827 2.504477
H  4.382765 1.231813 0.036023
H  -1.731297 -1.530732 1.318019
H  4.59899 -1.90578 -2.570128
H  3.325075 -0.95175 -3.293681
H  3.027485 -1.792613 -1.778505
H  4.635679 1.240904 -3.330917
H  6.028517 0.317163 -2.81318
H  5.52374 1.731984 -1.884447
H  -2.358491 1.304338 1.938717
H  -3.194781 -0.130066 2.518709
H  -1.113411 -2.207582 -1.305177
H  -1.832597 -1.172702 -2.545057
H  -0.397302 -0.649395 -1.672107
H  -5.259376 0.108017 -1.708027
H  -3.952527 -0.605756 -2.639072
H  -2.898487 1.66986 -2.930087
H  -4.531289 3.45345 -3.142947
H  -5.814762 2.406387 -2.329776
elementType: O C H
totalener: -965.41815323 hartree
nucrepener: 1790.58338341 hartree
electener: -2756.00153664 hartree
oneelecener: -4867.34290649 hartree
twoeener: 2111.34136985 hartree
cpcmener: -0.03610234 hartree
kineticenergy: 961.00643233 hartree
xcener: -95.142799662038 hartree
chargesum: -0.0000000
charge: -0.298348 -0.501873 -0.485074 0.126060 -0.020526 -0.063466 -0.294994 -0.276738 -0.266453 0.396965 -0.024393 0.267883 -0.263344 -0.228180 -0.140493 -0.037610 -0.073563 0.304385 -0.251163 -0.102274 -0.180309 -0.285114 0.101286 0.092120 0.103752 0.091124 0.098764 0.096562 0.099087 0.091335 0.119922 0.105574 0.101585 0.095638 0.087196 0.094847 0.094021 0.089243 0.103457 0.102688 0.117076 0.104439 0.113502 0.093012 0.111547 0.144641 0.132066 0.114138
qa: -0.2983 -0.5019 -0.4851 0.1261 -0.0205 -0.0635 -0.2950 -0.2767 -0.2665 0.3970 -0.0244 0.2679 -0.2633 -0.2282 -0.1405 -0.0376 -0.0736 0.3044 -0.2512 -0.1023 -0.1803 -0.2851 0.1013 0.0921 0.1038 0.0911 0.0988 0.0966 0.0991 0.0913 0.1199 0.1056 0.1016 0.0956 0.0872 0.0948 0.0940 0.0892 0.1035 0.1027 0.1171 0.1044 0.1135 0.0930 0.1115 0.1446 0.1321 0.1141
va: 2.1260 1.9952 2.0071 3.7337 3.8187 3.8139 3.9183 3.8945 3.9017 4.1582 3.7290 3.7314 3.9427 3.9264 3.9225 3.7764 3.4475 4.0473 3.9374 3.8624 3.7873 3.9495 1.0211 1.0345 0.9990 1.0041 1.0012 1.0001 0.9993 1.0191 1.0094 1.0301 0.9971 0.9972 1.0116 0.9962 0.9947 1.0080 1.0292 1.0229 1.0048 1.0059 0.9974 1.0218 1.0048 0.9998 1.0024 1.0125
dispcorr: -0.022163369 hartree
energy: -965.440316600400
dipole: 22.41814 -20.26219 2.15595 0.47306 -0.75202 -0.27896 -8.16511 7.42512 -0.73999
magnitude: 2.29642 au
magnitude: 5.83703 debye
