program: Orca
programVersion: 5.0.2
elementType: O O O C C C C C C C C C C C C C C C C C C C H H H H H H H H H H H H H H H H H H H H H H H H H H
charge: 0
multiplicity: 1
keywords: wb97x-d3
keywords: def2-TZVPP
keywords: def2/J RIJCOSX
keywords: DEFGRID2
keywords: scfconv7
keywords: smallprint printgap noloewdin
keywords: NOSOSCF
formula: C19H26O3
InChI: InChI=1/C19H26O3/c1-7-8-13-12(4)16(10-15(13)20)22-18(21)17-14(9-11(2)3)19(17,5)6/h7,9,14,16-17H,1,8,10H2,2-6H3
48 atoms
O  -0.260043 -0.063148 0.944063
O  0.668261 -1.976383 0.23298
O  -4.792684 0.964416 1.021395
C  3.092771 -0.947217 1.973022
C  3.345646 -0.727496 0.524312
C  2.040037 -0.235285 1.131728
C  3.795669 -0.074611 2.98459
C  2.854627 -2.351121 2.471643
C  4.336888 0.248333 0.005873
C  0.780628 -0.874282 0.72235
C  4.308248 0.764119 -1.226054
C  -1.570294 -0.474202 0.546637
C  3.238133 0.446003 -2.224153
C  5.363296 1.714005 -1.702674
C  -2.610736 0.030065 1.534779
C  -1.954166 0.146599 -0.774747
C  -3.15936 0.736115 -0.707257
C  -3.683449 0.625576 0.657152
C  -1.081879 0.002204 -1.96429
C  -3.966933 1.346887 -1.807889
C  -4.855925 0.309493 -2.430721
C  -6.179574 0.292923 -2.337991
H  3.21713 -1.616316 -0.087662
H  1.965058 0.831315 1.308923
H  4.792866 -0.464763 3.19812
H  3.905274 0.956483 2.649079
H  3.240504 -0.057695 3.923901
H  3.801597 -2.787308 2.795003
H  2.182859 -2.352226 3.332038
H  2.436506 -3.010804 1.714813
H  5.146666 0.535954 0.669956
H  -1.609732 -1.562155 0.460984
H  2.466129 -0.216219 -1.835306
H  3.666784 -0.026013 -3.112068
H  2.750865 1.361401 -2.569274
H  4.923567 2.668449 -2.00258
H  5.874083 1.32004 -2.585036
H  6.114524 1.912592 -0.93878
H  -2.201783 0.818723 2.171491
H  -3.007627 -0.748573 2.185398
H  -0.089385 0.421102 -1.781531
H  -0.93828 -1.053845 -2.202972
H  -1.497428 0.495478 -2.840419
H  -3.304535 1.769995 -2.566386
H  -4.56858 2.16811 -1.41349
H  -4.345726 -0.48279 -2.971075
H  -6.766373 -0.490597 -2.799949
H  -6.725684 1.059608 -1.801102
elementType: O C H
totalener: -965.41729645 hartree
nucrepener: 1797.03673171 hartree
electener: -2762.45402816 hartree
oneelecener: -4880.13989528 hartree
twoeener: 2117.68586712 hartree
cpcmener: -0.03585117 hartree
kineticenergy: 960.99480895 hartree
xcener: -95.140162415291 hartree
chargesum: 0.0000000
charge: -0.295379 -0.500254 -0.486238 0.157153 -0.029048 -0.088520 -0.292366 -0.274876 -0.295882 0.389992 -0.004888 0.251597 -0.243998 -0.231695 -0.134576 -0.023849 -0.076639 0.307677 -0.250840 -0.104840 -0.179463 -0.287299 0.100599 0.091484 0.101608 0.092446 0.098609 0.096508 0.100823 0.090631 0.125768 0.106542 0.069311 0.103544 0.098883 0.095761 0.096074 0.090073 0.104510 0.098686 0.110225 0.118228 0.105773 0.112894 0.094358 0.144582 0.132186 0.114122
qa: -0.2954 -0.5003 -0.4862 0.1572 -0.0290 -0.0885 -0.2924 -0.2749 -0.2959 0.3900 -0.0049 0.2516 -0.2440 -0.2317 -0.1346 -0.0238 -0.0766 0.3077 -0.2508 -0.1048 -0.1795 -0.2873 0.1006 0.0915 0.1016 0.0924 0.0986 0.0965 0.1008 0.0906 0.1258 0.1065 0.0693 0.1035 0.0989 0.0958 0.0961 0.0901 0.1045 0.0987 0.1102 0.1182 0.1058 0.1129 0.0944 0.1446 0.1322 0.1141
va: 2.1237 1.9917 2.0042 3.7091 3.8189 3.8162 3.9129 3.8881 3.8894 4.1466 3.6968 3.7702 3.9468 3.9287 3.9297 3.7416 3.4654 4.0449 3.9341 3.8629 3.7817 3.9526 1.0272 1.0344 0.9983 1.0010 1.0026 1.0008 0.9993 1.0181 1.0035 1.0307 1.0152 0.9999 0.9973 0.9963 0.9954 1.0063 1.0267 1.0254 1.0006 1.0012 1.0064 1.0041 1.0221 0.9993 1.0025 1.0132
dispcorr: -0.023117823 hartree
energy: -965.440414272269
dipole: 19.98932 -17.69080 2.29853 1.66692 -1.26378 0.40313 -6.34417 5.64585 -0.69832
magnitude: 2.43585 au
magnitude: 6.19145 debye
