program: Orca
programVersion: 5.0.2
elementType: O O O C C C C C C C C C C C C C C C C C C C H H H H H H H H H H H H H H H H H H H H H H H H H H
charge: 0
multiplicity: 1
keywords: wb97x-d3
keywords: def2-TZVPP
keywords: def2/J RIJCOSX
keywords: DEFGRID2
keywords: scfconv7
keywords: smallprint printgap noloewdin
keywords: NOSOSCF
formula: C19H26O3
InChI: InChI=1/C19H26O3/c1-7-8-13-12(4)16(10-15(13)20)22-18(21)17-14(9-11(2)3)19(17,5)6/h7,9,14,16-17H,1,8,10H2,2-6H3
48 atoms
O  -0.25461 -0.053738 0.961344
O  0.634793 -1.99353 0.271243
O  -4.779095 1.041129 1.036627
C  3.092876 -0.952846 1.962297
C  3.340615 -0.768174 0.507407
C  2.044024 -0.250281 1.108147
C  3.804288 -0.060382 2.949953
C  2.847307 -2.343378 2.493221
C  4.346482 0.184157 -0.029057
C  0.770658 -0.882175 0.733008
C  4.28034 0.752726 -1.235959
C  -1.577993 -0.447329 0.593311
C  3.146838 0.528562 -2.187788
C  5.351621 1.676965 -1.726434
C  -2.595111 0.122511 1.570491
C  -1.96184 0.131533 -0.746763
C  -3.156353 0.743605 -0.691313
C  -3.672566 0.68633 0.678915
C  -1.104327 -0.067375 -1.9385
C  -3.9591 1.322687 -1.812088
C  -4.80983 0.257711 -2.43918
C  -6.134645 0.21715 -2.385208
H  3.204116 -1.669948 -0.08433
H  1.983357 0.820568 1.262418
H  3.923402 0.959679 2.584829
H  3.248326 -0.011658 3.887741
H  4.79782 -0.453241 3.175449
H  2.424365 -3.018598 1.752369
H  3.793527 -2.776601 2.82342
H  2.177958 -2.3223 3.355055
H  5.203539 0.40493 0.600576
H  -1.646897 -1.536574 0.553014
H  2.406399 -0.179553 -1.819268
H  3.516268 0.158248 -3.14736
H  2.63319 1.4700 -2.400538
H  5.806697 1.296009 -2.644232
H  6.143216 1.817595 -0.990891
H  4.939023 2.658706 -1.97252
H  -2.164076 0.940794 2.153248
H  -2.98977 -0.611705 2.272184
H  -1.519466 0.405683 -2.825616
H  -0.103307 0.339398 -1.778796
H  -0.981742 -1.1327 -2.145326
H  -3.292713 1.753348 -2.563245
H  -4.587518 2.133608 -1.439714
H  -4.270322 -0.535238 -2.948583
H  -6.692598 -0.581869 -2.85497
H  -6.710153 0.987775 -1.887673
elementType: O C H
totalener: -965.41714210 hartree
nucrepener: 1799.00677714 hartree
electener: -2764.42391924 hartree
oneelecener: -4884.03781323 hartree
twoeener: 2119.61389399 hartree
cpcmener: -0.03587134 hartree
kineticenergy: 961.00390016 hartree
xcener: -95.141908437583 hartree
chargesum: -0.0000000
charge: -0.293785 -0.499476 -0.486336 0.157488 -0.024924 -0.095251 -0.291361 -0.276682 -0.299857 0.388575 -0.004825 0.252994 -0.241366 -0.231885 -0.132518 -0.022471 -0.078574 0.306874 -0.252412 -0.100986 -0.181391 -0.287147 0.101400 0.091694 0.093276 0.098578 0.100793 0.090382 0.096689 0.101085 0.125666 0.105978 0.069956 0.102016 0.101444 0.096637 0.090324 0.095542 0.105160 0.097206 0.105620 0.110936 0.118901 0.113304 0.091606 0.144656 0.132118 0.114349
qa: -0.2938 -0.4995 -0.4863 0.1575 -0.0249 -0.0953 -0.2914 -0.2767 -0.2999 0.3886 -0.0048 0.2530 -0.2414 -0.2319 -0.1325 -0.0225 -0.0786 0.3069 -0.2524 -0.1010 -0.1814 -0.2871 0.1014 0.0917 0.0933 0.0986 0.1008 0.0904 0.0967 0.1011 0.1257 0.1060 0.0700 0.1020 0.1014 0.0966 0.0903 0.0955 0.1052 0.0972 0.1056 0.1109 0.1189 0.1133 0.0916 0.1447 0.1321 0.1143
va: 2.1234 1.9928 2.0038 3.6984 3.8203 3.8153 3.9122 3.8904 3.8926 4.1487 3.6944 3.7716 3.9442 3.9295 3.9269 3.7369 3.4690 4.0458 3.9343 3.8635 3.7858 3.9549 1.0269 1.0343 1.0012 1.0027 0.9987 1.0179 1.0008 0.9991 1.0028 1.0304 1.0146 1.0006 0.9965 0.9957 1.0061 0.9961 1.0263 1.0259 1.0060 1.0012 1.0014 1.0034 1.0236 0.9988 1.0024 1.0127
dispcorr: -0.023239141 hartree
energy: -965.440381241410
dipole: 19.88704 -17.59009 2.29695 1.58671 -1.18557 0.40114 -6.44895 5.73941 -0.70954
magnitude: 2.43728 au
magnitude: 6.19508 debye
