program: Orca
programVersion: 5.0.2
elementType: O O O C C C C C C C C C C C C C C C C C C C H H H H H H H H H H H H H H H H H H H H H H H H H H
charge: 0
multiplicity: 1
keywords: wb97x-d3
keywords: def2-TZVPP
keywords: def2/J RIJCOSX
keywords: DEFGRID2
keywords: scfconv7
keywords: smallprint printgap noloewdin
keywords: NOSOSCF
formula: C19H26O3
InChI: InChI=1/C19H26O3/c1-7-8-13-12(4)16(10-15(13)20)22-18(21)17-14(9-11(2)3)19(17,5)6/h7,9,14,16-17H,1,8,10H2,2-6H3
48 atoms
O  -0.568073 0.070297 0.252208
O  0.650765 0.401225 2.101206
O  -4.844214 1.76175 0.324315
C  2.784189 1.392199 0.032771
C  3.107867 -0.017011 0.417533
C  1.708639 0.317601 -0.045606
C  3.276444 1.915058 -1.293837
C  2.752762 2.447926 1.108076
C  3.95062 -0.892864 -0.433814
C  0.581852 0.273492 0.899838
C  5.246824 -1.140472 -0.228574
C  -1.789949 0.025573 0.994447
C  6.037719 -0.544182 0.894914
C  6.015827 -2.049359 -1.137603
C  -2.539166 1.351848 0.967424
C  -2.706162 -0.956684 0.31728
C  -3.905183 -0.418407 0.04551
C  -3.903816 0.997328 0.424199
C  -2.252387 -2.34024 0.048107
C  -5.077477 -1.079855 -0.591082
C  -5.027731 -1.116053 -2.091323
C  -4.032222 -0.693923 -2.861105
H  3.201417 -0.172577 1.488682
H  1.458707 0.005797 -1.053945
H  4.309451 2.258033 -1.206006
H  3.243526 1.162773 -2.081279
H  2.672993 2.764058 -1.619399
H  2.017842 3.222691 0.881707
H  2.534028 2.049462 2.095579
H  3.729789 2.931529 1.163367
H  3.466629 -1.357226 -1.288258
H  -1.592986 -0.308773 2.015562
H  6.890578 0.01631 0.504182
H  6.453288 -1.326083 1.535654
H  5.457514 0.13113 1.521555
H  5.393763 -2.455227 -1.935209
H  6.443836 -2.888395 -0.583034
H  6.855903 -1.523032 -1.597777
H  -2.058621 2.069949 0.299003
H  -2.620147 1.822234 1.947806
H  -3.073869 -2.994906 -0.235917
H  -1.522051 -2.351421 -0.763874
H  -1.75505 -2.761932 0.923242
H  -5.998906 -0.576065 -0.28513
H  -5.177954 -2.105971 -0.224867
H  -5.90671 -1.546692 -2.56052
H  -4.095038 -0.773861 -3.938474
H  -3.125886 -0.256267 -2.460172
elementType: O C H
totalener: -965.41794188 hartree
nucrepener: 1780.93335457 hartree
electener: -2746.35129645 hartree
oneelecener: -4848.02886345 hartree
twoeener: 2101.67756700 hartree
cpcmener: -0.03648218 hartree
kineticenergy: 961.01284466 hartree
xcener: -95.144008414574 hartree
chargesum: 0.0000000
charge: -0.303061 -0.501276 -0.483717 0.147023 -0.011134 -0.129913 -0.270661 -0.300477 -0.262672 0.431299 -0.037837 0.260973 -0.250248 -0.229704 -0.138781 -0.042395 -0.094239 0.334918 -0.266999 -0.068979 -0.189846 -0.280279 0.100519 0.092757 0.096496 0.092806 0.100445 0.102812 0.093104 0.097051 0.123502 0.109695 0.097091 0.100022 0.087101 0.090098 0.095105 0.094401 0.103215 0.102789 0.104398 0.111903 0.120337 0.089589 0.105606 0.133448 0.133531 0.110183
qa: -0.3031 -0.5013 -0.4837 0.1470 -0.0111 -0.1299 -0.2707 -0.3005 -0.2627 0.4313 -0.0378 0.2610 -0.2502 -0.2297 -0.1388 -0.0424 -0.0942 0.3349 -0.2670 -0.0690 -0.1898 -0.2803 0.1005 0.0928 0.0965 0.0928 0.1004 0.1028 0.0931 0.0971 0.1235 0.1097 0.0971 0.1000 0.0871 0.0901 0.0951 0.0944 0.1032 0.1028 0.1044 0.1119 0.1203 0.0896 0.1056 0.1334 0.1335 0.1102
va: 2.1235 2.0034 2.0147 3.6578 3.7905 3.9113 3.9057 3.9013 3.8668 4.1321 3.7015 3.7193 3.9408 3.9266 3.9156 3.7233 3.4800 4.0251 3.9478 3.8253 3.8400 3.8965 1.0222 1.0364 1.0021 1.0018 1.0026 0.9989 1.0190 1.0006 1.0063 1.0262 0.9974 0.9981 1.0082 1.0075 0.9952 0.9962 1.0254 1.0242 1.0024 0.9994 0.9995 1.0207 0.9997 1.0020 1.0040 1.0201
dispcorr: -0.022626310 hartree
energy: -965.440568188966
dipole: 25.28583 -23.49748 1.78835 -4.65375 2.99577 -1.65798 -7.35297 6.60047 -0.75249
magnitude: 2.55212 au
magnitude: 6.48698 debye
