program: Orca
programVersion: 5.0.2
elementType: O O O C C C C C C C C C C C C C C C C C C C H H H H H H H H H H H H H H H H H H H H H H H H H H
charge: 0
multiplicity: 1
keywords: wb97x-d3
keywords: def2-TZVPP
keywords: def2/J RIJCOSX
keywords: DEFGRID2
keywords: scfconv7
keywords: smallprint printgap noloewdin
keywords: NOSOSCF
formula: C19H26O3
InChI: InChI=1/C19H26O3/c1-7-8-13-12(4)16(10-15(13)20)22-18(21)17-14(9-11(2)3)19(17,5)6/h7,9,14,16-17H,1,8,10H2,2-6H3
48 atoms
O  -0.521697 -0.093641 0.302905
O  0.634183 1.341793 1.564843
O  -4.627187 1.862695 -0.229206
C  2.704426 1.173324 -0.770068
C  3.145598 0.222011 0.298275
C  1.721292 0.154576 -0.211128
C  3.148961 0.931726 -2.19166
C  2.589191 2.638378 -0.429284
C  4.058222 -0.911029 0.01322
C  0.597225 0.547181 0.652523
C  5.337234 -0.990081 0.390581
C  -1.715356 0.209422 1.031888
C  6.052376 0.075988 1.161964
C  6.174927 -2.181687 0.038832
C  -2.373526 1.512699 0.596046
C  -2.721707 -0.863717 0.717507
C  -3.882568 -0.351084 0.280234
C  -3.759418 1.104264 0.157931
C  -2.383877 -2.291695 0.918945
C  -5.124272 -1.087843 -0.087062
C  -5.13671 -1.633272 -1.485273
C  -4.145772 -1.574976 -2.366239
H  3.249565 0.678132 1.278159
H  1.500731 -0.670204 -0.879436
H  2.492685 1.453245 -2.890497
H  4.161504 1.310534 -2.343675
H  3.145888 -0.123784 -2.460373
H  1.779255 3.113587 -0.985541
H  2.428588 2.823298 0.629615
H  3.516009 3.142983 -0.707887
H  3.644667 -1.731878 -0.565623
H  -1.499769 0.199503 2.103733
H  6.470756 -0.328184 2.086832
H  5.422947 0.925499 1.420513
H  6.898697 0.456256 0.584278
H  7.036407 -1.887186 -0.565852
H  5.612669 -2.930848 -0.517654
H  6.577615 -2.658288 0.935959
H  -1.846688 1.981003 -0.237712
H  -2.43087 2.249131 1.397587
H  -1.891339 -2.443429 1.88061
H  -3.261449 -2.933153 0.871102
H  -1.684945 -2.629232 0.150714
H  -5.992143 -0.434219 0.03925
H  -5.288632 -1.917041 0.607354
H  -6.062602 -2.124053 -1.768131
H  -4.256356 -2.00705 -3.351988
H  -3.196309 -1.100563 -2.149191
elementType: O C H
totalener: -965.41897162 hartree
nucrepener: 1781.92176475 hartree
electener: -2747.34073636 hartree
oneelecener: -4850.11909141 hartree
twoeener: 2102.77835505 hartree
cpcmener: -0.03703421 hartree
kineticenergy: 961.01049943 hartree
xcener: -95.143586568235 hartree
chargesum: 0.0000000
charge: -0.302768 -0.500250 -0.483326 0.151347 0.001209 -0.120297 -0.264199 -0.297908 -0.275962 0.414721 -0.033424 0.265400 -0.251760 -0.228173 -0.152790 -0.045464 -0.092397 0.331676 -0.265482 -0.071284 -0.190466 -0.279594 0.099344 0.091942 0.098814 0.096107 0.090498 0.102042 0.092879 0.097243 0.124857 0.110481 0.097128 0.088957 0.097314 0.094590 0.090145 0.094806 0.106326 0.106317 0.120233 0.103576 0.113291 0.089927 0.106565 0.134009 0.133496 0.110304
qa: -0.3028 -0.5002 -0.4833 0.1513 0.0012 -0.1203 -0.2642 -0.2979 -0.2760 0.4147 -0.0334 0.2654 -0.2518 -0.2282 -0.1528 -0.0455 -0.0924 0.3317 -0.2655 -0.0713 -0.1905 -0.2796 0.0993 0.0919 0.0988 0.0961 0.0905 0.1020 0.0929 0.0972 0.1249 0.1105 0.0971 0.0890 0.0973 0.0946 0.0901 0.0948 0.1063 0.1063 0.1202 0.1036 0.1133 0.0899 0.1066 0.1340 0.1335 0.1103
va: 2.1271 2.0028 2.0162 3.6557 3.7824 3.9318 3.9050 3.9013 3.8729 4.1199 3.7084 3.7337 3.9434 3.9241 3.9068 3.7420 3.4682 4.0252 3.9503 3.8230 3.8403 3.8967 1.0231 1.0367 1.0026 1.0029 1.0032 0.9990 1.0190 1.0004 1.0064 1.0174 0.9980 1.0083 0.9970 0.9959 1.0078 0.9958 1.0237 1.0228 0.9996 1.0029 0.9992 1.0197 0.9993 1.0018 1.0039 1.0198
dispcorr: -0.022518546 hartree
energy: -965.441490163550
dipole: 24.33605 -22.68324 1.65282 -7.25660 5.11620 -2.14040 -5.50783 5.53780 0.02996
magnitude: 2.70444 au
magnitude: 6.87415 debye
