program: Orca
programVersion: 5.0.2
elementType: O O O C C C C C C C C C C C C C C C C C C C H H H H H H H H H H H H H H H H H H H H H H H H H H
charge: 0
multiplicity: 1
keywords: wb97x-d3
keywords: def2-TZVPP
keywords: def2/J RIJCOSX
keywords: DEFGRID2
keywords: scfconv7
keywords: smallprint printgap noloewdin
keywords: NOSOSCF
formula: C19H26O3
InChI: InChI=1/C19H26O3/c1-7-8-13-12(4)16(10-15(13)20)22-18(21)17-14(9-11(2)3)19(17,5)6/h7,9,14,16-17H,1,8,10H2,2-6H3
48 atoms
O  -0.339763 0.032443 1.458955
O  0.138281 0.161969 -0.723522
O  -3.828824 2.307522 -0.801823
C  2.639941 -1.489799 0.39525
C  3.03105 -0.130934 -0.104234
C  1.877652 -0.262102 0.8687
C  3.482604 -2.182061 1.438245
C  2.000584 -2.451247 -0.575798
C  4.258846 0.562711 0.331286
C  0.498938 0.001659 0.420049
C  5.077291 1.291126 -0.435651
C  -1.73109 0.274237 1.244182
C  4.897936 1.524224 -1.904991
C  6.277001 1.968904 0.155833
C  -2.098619 1.678541 0.778965
C  -2.390735 -0.655124 0.256974
C  -3.223157 0.00878 -0.561102
C  -3.15098 1.442901 -0.277646
C  -2.170493 -2.118689 0.333064
C  -4.151356 -0.552931 -1.581438
C  -5.526756 -0.856981 -1.061864
C  -5.929656 -0.770474 0.200002
H  2.721233 0.062489 -1.125369
H  2.075135 0.018593 1.897602
H  3.880771 -1.498421 2.186498
H  2.89255 -2.935308 1.963238
H  4.326323 -2.692291 0.969393
H  1.298959 -3.114012 -0.064784
H  1.469307 -1.954624 -1.385247
H  2.770401 -3.077714 -1.030179
H  4.502615 0.481103 1.386651
H  -2.163888 0.079405 2.227942
H  5.824233 1.303891 -2.441479
H  4.672632 2.576356 -2.101323
H  4.107245 0.926745 -2.354725
H  6.238672 3.048239 -0.013657
H  7.198798 1.617355 -0.314741
H  6.360015 1.799887 1.229263
H  -1.256024 2.217666 0.341509
H  -2.490943 2.299246 1.584778
H  -1.165426 -2.384259 -0.004802
H  -2.255701 -2.464591 1.364976
H  -2.88208 -2.672864 -0.27546
H  -3.734388 -1.465647 -2.016323
H  -4.242524 0.144204 -2.419576
H  -6.233693 -1.18512 -1.817469
H  -6.94614 -1.019709 0.475541
H  -5.27572 -0.450799 1.002699
elementType: O C H
totalener: -965.41652613 hartree
nucrepener: 1812.78356550 hartree
electener: -2778.20009163 hartree
oneelecener: -4912.19779260 hartree
twoeener: 2133.99770097 hartree
cpcmener: -0.04040584 hartree
kineticenergy: 960.99399095 hartree
xcener: -95.144859653367 hartree
chargesum: 0.0000000
charge: -0.297854 -0.490334 -0.491386 0.120955 0.034045 -0.107197 -0.276616 -0.291209 -0.289963 0.407081 -0.048318 0.286233 -0.256011 -0.218495 -0.148964 0.009387 -0.145311 0.317937 -0.260197 -0.091594 -0.187817 -0.282431 0.091137 0.090976 0.090283 0.097702 0.097717 0.098247 0.094102 0.105290 0.121935 0.120940 0.094024 0.099673 0.092076 0.092940 0.094024 0.088607 0.112900 0.107432 0.121654 0.116153 0.103889 0.102260 0.094423 0.133393 0.133454 0.112825
qa: -0.2979 -0.4903 -0.4914 0.1210 0.0340 -0.1072 -0.2766 -0.2912 -0.2900 0.4071 -0.0483 0.2862 -0.2560 -0.2185 -0.1490 0.0094 -0.1453 0.3179 -0.2602 -0.0916 -0.1878 -0.2824 0.0911 0.0910 0.0903 0.0977 0.0977 0.0982 0.0941 0.1053 0.1219 0.1209 0.0940 0.0997 0.0921 0.0929 0.0940 0.0886 0.1129 0.1074 0.1217 0.1162 0.1039 0.1023 0.0944 0.1334 0.1335 0.1128
va: 2.1328 2.0176 2.0039 3.6707 3.7862 3.8174 3.9078 3.9053 3.8793 4.1791 3.7570 3.7712 3.9398 3.9204 3.8886 3.6371 3.4752 4.0392 3.9467 3.8456 3.8258 3.9024 1.0327 1.0366 1.0063 1.0015 1.0016 0.9993 1.0151 1.0021 1.0103 0.9940 0.9978 0.9956 1.0091 0.9957 0.9963 1.0087 1.0241 1.0240 0.9939 0.9986 1.0029 1.0015 1.0164 1.0025 1.0037 1.0151
dispcorr: -0.023522299 hartree
energy: -965.440048432623
dipole: 20.17421 -18.50929 1.66492 -9.41895 7.33976 -2.07919 -0.46707 2.03294 1.56587
magnitude: 3.08981 au
magnitude: 7.85367 debye
