program: Orca
programVersion: 5.0.2
elementType: O O O C C C C C C C C C C C C C C C C C C C H H H H H H H H H H H H H H H H H H H H H H H H H H
charge: 0
multiplicity: 1
keywords: wb97x-d3
keywords: def2-TZVPP
keywords: def2/J RIJCOSX
keywords: DEFGRID2
keywords: scfconv7
keywords: smallprint printgap noloewdin
keywords: NOSOSCF
formula: C19H26O3
InChI: InChI=1/C19H26O3/c1-7-8-13-12(4)16(10-15(13)20)22-18(21)17-14(9-11(2)3)19(17,5)6/h7,9,14,16-17H,1,8,10H2,2-6H3
48 atoms
O  -0.370514 0.449505 1.711911
O  -0.140576 0.12331 -0.49119
O  -3.986518 2.114498 -0.805623
C  2.416227 -1.422549 0.559751
C  2.81167 -0.138427 -0.104852
C  1.743363 -0.119625 0.967771
C  3.322825 -2.041402 1.595802
C  1.671306 -2.448999 -0.257687
C  4.102632 0.529384 0.155611
C  0.340281 0.158671 0.618343
C  4.957056 0.986924 -0.765914
C  -1.778384 0.675795 1.606175
C  4.750743 0.893635 -2.247064
C  6.2362 1.655887 -0.360398
C  -2.204038 1.916388 0.828353
C  -2.531615 -0.468869 0.975918
C  -3.43178 -0.032084 0.080887
C  -3.305633 1.41904 -0.075682
C  -2.275323 -1.861766 1.4114
C  -4.392129 -0.822723 -0.746744
C  -3.813146 -1.0701 -2.109684
C  -4.283176 -0.546179 -3.23465
H  2.425254 -0.032676 -1.112918
H  2.04423 0.253518 1.940605
H  4.11726 -2.615563 1.115213
H  3.790991 -1.304231 2.2463
H  2.759328 -2.727704 2.230207
H  2.384984 -3.151059 -0.69307
H  0.984261 -3.026309 0.364827
H  1.103167 -2.017132 -1.078617
H  4.372096 0.656301 1.200195
H  -2.087439 0.757064 2.650154
H  3.861702 0.334245 -2.535541
H  5.611284 0.412567 -2.721039
H  4.676023 1.892352 -2.688922
H  6.338474 1.73056 0.722049
H  6.299288 2.664686 -0.776807
H  7.101695 1.109847 -0.744979
H  -1.400197 2.353244 0.234194
H  -2.579116 2.70482 1.482117
H  -3.040814 -2.549337 1.057011
H  -1.314206 -2.219424 1.032488
H  -2.226941 -1.925159 2.49984
H  -5.338382 -0.28414 -0.835271
H  -4.610081 -1.775844 -0.259646
H  -2.934654 -1.708303 -2.13908
H  -3.818168 -0.751016 -4.190516
H  -5.154169 0.099097 -3.243899
elementType: O C H
totalener: -965.41644572 hartree
nucrepener: 1822.78788834 hartree
electener: -2788.20433405 hartree
oneelecener: -4932.51732855 hartree
twoeener: 2144.31299450 hartree
cpcmener: -0.04109944 hartree
kineticenergy: 960.99583274 hartree
xcener: -95.142571349958 hartree
chargesum: -0.0000000
charge: -0.299124 -0.493139 -0.489132 0.122516 0.041274 -0.108067 -0.272540 -0.293436 -0.291298 0.400514 -0.044409 0.290198 -0.254948 -0.220146 -0.148051 -0.012698 -0.122052 0.295685 -0.259832 -0.101604 -0.179013 -0.287093 0.091641 0.089309 0.097745 0.090033 0.097993 0.104834 0.096851 0.095815 0.122307 0.120718 0.090924 0.094791 0.098562 0.088843 0.093220 0.094496 0.113490 0.111715 0.107029 0.116407 0.116560 0.093783 0.110036 0.143259 0.131822 0.114208
qa: -0.2991 -0.4931 -0.4891 0.1225 0.0413 -0.1081 -0.2725 -0.2934 -0.2913 0.4005 -0.0444 0.2902 -0.2549 -0.2201 -0.1481 -0.0127 -0.1221 0.2957 -0.2598 -0.1016 -0.1790 -0.2871 0.0916 0.0893 0.0977 0.0900 0.0980 0.1048 0.0969 0.0958 0.1223 0.1207 0.0909 0.0948 0.0986 0.0888 0.0932 0.0945 0.1135 0.1117 0.1070 0.1164 0.1166 0.0938 0.1100 0.1433 0.1318 0.1142
va: 2.1318 2.0093 2.0030 3.6638 3.7812 3.8559 3.9070 3.9046 3.8761 4.1612 3.7495 3.7633 3.9424 3.9212 3.8777 3.6820 3.4673 4.0593 3.9483 3.8683 3.7736 3.9464 1.0325 1.0386 1.0019 1.0056 1.0019 1.0016 0.9998 1.0163 1.0097 0.9918 1.0093 0.9973 0.9960 1.0089 0.9958 0.9962 1.0265 1.0215 1.0041 0.9942 1.0000 1.0200 1.0086 1.0014 1.0029 1.0128
dispcorr: -0.023432833 hartree
energy: -965.439878551794
dipole: 21.55676 -19.83621 1.72055 -10.30446 8.60281 -1.70165 -3.09719 5.33756 2.24037
magnitude: 3.29775 au
magnitude: 8.38222 debye
