program: Orca
programVersion: 5.0.2
elementType: O O O C C C C C C C C C C C C C C C C C C C H H H H H H H H H H H H H H H H H H H H H H H H H H
charge: 0
multiplicity: 1
keywords: wb97x-d3
keywords: def2-TZVPP
keywords: def2/J RIJCOSX
keywords: DEFGRID2
keywords: scfconv7
keywords: smallprint printgap noloewdin
keywords: NOSOSCF
formula: C19H26O3
InChI: InChI=1/C19H26O3/c1-7-8-13-12(4)16(10-15(13)20)22-18(21)17-14(9-11(2)3)19(17,5)6/h7,9,14,16-17H,1,8,10H2,2-6H3
48 atoms
O  -0.54652 0.023004 0.306844
O  0.605328 1.883322 0.747259
O  -4.708582 1.657877 -0.837642
C  2.679984 0.616273 -1.230614
C  3.119978 0.333083 0.171915
C  1.704136 -0.004378 -0.241423
C  3.151079 -0.297261 -2.335151
C  2.525552 2.051761 -1.668525
C  4.049875 -0.774375 0.503339
C  0.573714 0.751916 0.31891
C  5.348267 -0.630635 0.783162
C  -1.729446 0.621629 0.845478
C  6.062338 0.685883 0.777374
C  6.204139 -1.814395 1.116194
C  -2.397833 1.61703 -0.095559
C  -2.73479 -0.48183 1.028656
C  -3.906962 -0.194219 0.442664
C  -3.807313 1.095524 -0.246134
C  -2.384419 -1.702137 1.793148
C  -5.1369 -1.031174 0.402655
C  -5.132572 -2.066297 -0.68636
C  -4.128897 -2.339232 -1.511051
H  3.204266 1.218879 0.795125
H  1.496349 -1.055518 -0.409644
H  2.489842 -0.228113 -3.200576
H  4.153349 -0.011175 -2.661461
H  3.188475 -1.342233 -2.029006
H  1.696483 2.165991 -2.369397
H  2.365837 2.737545 -0.839715
H  3.434013 2.371717 -2.182347
H  3.630623 -1.776486 0.51055
H  -1.49769 1.07225 1.814688
H  6.849518 0.685353 0.018844
H  6.558948 0.86381 1.734243
H  5.4104 1.533408 0.573663
H  6.656967 -1.704552 2.104927
H  7.031315 -1.910562 0.408089
H  5.639612 -2.746518 1.104984
H  -1.915534 1.632361 -1.07609
H  -2.398573 2.638617 0.284429
H  -3.265075 -2.283068 2.061472
H  -1.729477 -2.347905 1.203405
H  -1.840933 -1.45003 2.705433
H  -6.016925 -0.393952 0.277114
H  -5.284458 -1.538773 1.360855
H  -6.053862 -2.633469 -0.773254
H  -4.222558 -3.114329 -2.260568
H  -3.183096 -1.811666 -1.477182
elementType: O C H
totalener: -965.41883977 hartree
nucrepener: 1784.14103125 hartree
electener: -2749.55987102 hartree
oneelecener: -4854.53220711 hartree
twoeener: 2104.97233609 hartree
cpcmener: -0.03689576 hartree
kineticenergy: 961.00212195 hartree
xcener: -95.141761977895 hartree
chargesum: -0.0000000
charge: -0.303211 -0.499660 -0.483227 0.151768 -0.010164 -0.110643 -0.267364 -0.299696 -0.266734 0.412016 -0.036731 0.268749 -0.251973 -0.228838 -0.152890 -0.045212 -0.093332 0.328610 -0.269456 -0.069306 -0.187992 -0.279077 0.099991 0.092557 0.099657 0.095676 0.091529 0.102855 0.092909 0.096813 0.123886 0.111704 0.098040 0.097943 0.088894 0.095222 0.094386 0.089806 0.107923 0.104346 0.105178 0.112575 0.120722 0.089471 0.106318 0.133485 0.133237 0.109241
qa: -0.3032 -0.4997 -0.4832 0.1518 -0.0102 -0.1106 -0.2674 -0.2997 -0.2667 0.4120 -0.0367 0.2687 -0.2520 -0.2288 -0.1529 -0.0452 -0.0933 0.3286 -0.2695 -0.0693 -0.1880 -0.2791 0.1000 0.0926 0.0997 0.0957 0.0915 0.1029 0.0929 0.0968 0.1239 0.1117 0.0980 0.0979 0.0889 0.0952 0.0944 0.0898 0.1079 0.1043 0.1052 0.1126 0.1207 0.0895 0.1063 0.1335 0.1332 0.1092
va: 2.1272 2.0044 2.0162 3.6569 3.7872 3.9249 3.9065 3.9011 3.8669 4.1269 3.7053 3.7328 3.9419 3.9256 3.9018 3.7363 3.4739 4.0263 3.9515 3.8228 3.8397 3.8956 1.0226 1.0352 1.0025 1.0024 1.0025 0.9989 1.0180 1.0007 1.0065 1.0164 0.9968 0.9985 1.0082 0.9956 0.9958 1.0077 1.0223 1.0246 1.0022 0.9988 0.9996 1.0211 1.0003 1.0020 1.0041 1.0212
dispcorr: -0.022717207 hartree
energy: -965.441556975300
dipole: 24.61777 -22.87759 1.74018 -9.17475 7.13357 -2.04118 -2.42917 3.27695 0.84778
magnitude: 2.81308 au
magnitude: 7.15027 debye
