program: Orca
programVersion: 5.0.2
elementType: O O O C C C C C C C C C C C C C C C C C C C H H H H H H H H H H H H H H H H H H H H H H H H H H
charge: 0
multiplicity: 1
keywords: wb97x-d3
keywords: def2-TZVPP
keywords: def2/J RIJCOSX
keywords: DEFGRID2
keywords: scfconv7
keywords: smallprint printgap noloewdin
keywords: NOSOSCF
formula: C19H26O3
InChI: InChI=1/C19H26O3/c1-7-8-13-12(4)16(10-15(13)20)22-18(21)17-14(9-11(2)3)19(17,5)6/h7,9,14,16-17H,1,8,10H2,2-6H3
48 atoms
O  -0.463162 0.059509 0.351209
O  0.674159 1.9717 0.54352
O  -4.557649 1.280184 -1.282706
C  2.763362 0.441454 -1.229505
C  3.203128 0.381903 0.200163
C  1.792786 -0.029994 -0.155929
C  3.247181 -0.625247 -2.180534
C  2.59484 1.788446 -1.886999
C  4.139245 -0.657482 0.69675
C  0.651513 0.790873 0.277668
C  5.445672 -0.478255 0.907891
C  -1.668041 0.721449 0.751206
C  6.159268 0.811917 0.647563
C  6.3075 -1.590705 1.422584
C  -2.320371 1.518089 -0.372208
C  -2.663386 -0.349272 1.108938
C  -3.81158 -0.211999 0.427582
C  -3.692669 0.904847 -0.515489
C  -2.319924 -1.375802 2.121139
C  -5.043508 -1.054909 0.496557
C  -4.988677 -2.150859 -0.526934
C  -5.818104 -2.267797 -1.556115
H  3.278881 1.353125 0.680955
H  1.597995 -1.096947 -0.16062
H  3.3164 -1.606167 -1.7117
H  2.576217 -0.711173 -3.036919
H  4.238182 -0.369834 -2.561472
H  2.399941 2.592112 -1.181088
H  3.510248 2.044676 -2.423466
H  1.783005 1.773102 -2.616806
H  3.715875 -1.637686 0.897035
H  -1.467553 1.341234 1.629301
H  5.509161 1.594748 0.260188
H  6.964445 0.661637 -0.076151
H  6.63305 1.18558 1.55873
H  6.797087 -1.30793 2.357912
H  7.106666 -1.825453 0.715005
H  5.737658 -2.502078 1.602566
H  -1.776339 1.423182 -1.314547
H  -2.399559 2.582371 -0.148892
H  -1.826292 -0.923031 2.982604
H  -3.195721 -1.921032 2.46791
H  -1.620798 -2.104504 1.704804
H  -5.927302 -0.434393 0.333928
H  -5.137005 -1.492029 1.493615
H  -4.192317 -2.877426 -0.393527
H  -5.725228 -3.080358 -2.265177
H  -6.62099 -1.560001 -1.726688
elementType: O C H
totalener: -965.41878129 hartree
nucrepener: 1769.31736430 hartree
electener: -2734.73614559 hartree
oneelecener: -4824.97262332 hartree
twoeener: 2090.23647773 hartree
cpcmener: -0.03756019 hartree
kineticenergy: 961.00769953 hartree
xcener: -95.140339189204 hartree
chargesum: 0.0000000
charge: -0.298453 -0.500275 -0.484033 0.143396 -0.012891 -0.105393 -0.269873 -0.299773 -0.263298 0.412417 -0.036974 0.252767 -0.250931 -0.230890 -0.143379 -0.042931 -0.061390 0.310196 -0.266606 -0.105402 -0.179035 -0.285076 0.100322 0.093222 0.092363 0.100239 0.096256 0.093736 0.097352 0.103721 0.124009 0.107175 0.088100 0.096904 0.099643 0.095428 0.094942 0.090021 0.105694 0.107501 0.115939 0.104537 0.112665 0.092567 0.114010 0.144757 0.131955 0.114772
qa: -0.2985 -0.5003 -0.4840 0.1434 -0.0129 -0.1054 -0.2699 -0.2998 -0.2633 0.4124 -0.0370 0.2528 -0.2509 -0.2309 -0.1434 -0.0429 -0.0614 0.3102 -0.2666 -0.1054 -0.1790 -0.2851 0.1003 0.0932 0.0924 0.1002 0.0963 0.0937 0.0974 0.1037 0.1240 0.1072 0.0881 0.0969 0.0996 0.0954 0.0949 0.0900 0.1057 0.1075 0.1159 0.1045 0.1127 0.0926 0.1140 0.1448 0.1320 0.1148
va: 2.1292 2.0029 2.0101 3.6653 3.7922 3.9064 3.9058 3.8983 3.8665 4.1327 3.7010 3.7601 3.9407 3.9264 3.9043 3.7633 3.4535 4.0491 3.9520 3.8541 3.7844 3.9480 1.0228 1.0352 1.0021 1.0026 1.0023 1.0181 1.0009 0.9988 1.0061 1.0170 1.0080 0.9972 0.9982 0.9955 0.9959 1.0076 1.0252 1.0216 0.9993 1.0039 1.0000 1.0221 1.0043 0.9999 1.0023 1.0119
dispcorr: -0.022128220 hartree
energy: -965.440909513245
dipole: 23.34832 -21.52149 1.82683 -8.52314 6.77416 -1.74899 -0.91870 2.18179 1.26308
magnitude: 2.82695 au
magnitude: 7.18553 debye
