program: Orca
programVersion: 5.0.2
elementType: O O O C C C C C C C C C C C C C C C C C C C H H H H H H H H H H H H H H H H H H H H H H H H H H
charge: 0
multiplicity: 1
keywords: wb97x-d3
keywords: def2-TZVPP
keywords: def2/J RIJCOSX
keywords: DEFGRID2
keywords: scfconv7
keywords: smallprint printgap noloewdin
keywords: NOSOSCF
formula: C19H26O3
InChI: InChI=1/C19H26O3/c1-7-8-13-12(4)16(10-15(13)20)22-18(21)17-14(9-11(2)3)19(17,5)6/h7,9,14,16-17H,1,8,10H2,2-6H3
48 atoms
O  -0.131869 0.419342 1.548811
O  -0.067193 -0.299644 -0.567631
O  -3.618179 2.21625 -1.079146
C  2.497359 -1.800247 0.497724
C  2.879793 -0.620492 -0.325031
C  1.886457 -0.438817 0.809212
C  3.464054 -2.314834 1.536337
C  1.656093 -2.890013 -0.11935
C  4.218783 0.018468 -0.242542
C  0.487349 -0.118322 0.493085
C  4.455363 1.311858 -0.478208
C  -1.499997 0.813975 1.433254
C  3.380047 2.295527 -0.822684
C  5.837943 1.882461 -0.398389
C  -1.779154 1.978198 0.487894
C  -2.431871 -0.287013 0.993416
C  -3.318157 0.153617 0.085933
C  -2.999137 1.534126 -0.283921
C  -2.34373 -1.636363 1.599611
C  -4.430962 -0.594579 -0.574235
C  -3.96493 -1.164926 -1.882614
C  -4.388486 -0.766868 -3.075532
H  2.41492 -0.590315 -1.307536
H  2.262597 0.031854 1.710135
H  2.929959 -2.852255 2.32166
H  4.175086 -3.010418 1.086207
H  4.033736 -1.516395 2.011261
H  2.306141 -3.666567 -0.526798
H  1.014338 -3.359898 0.62884
H  1.025823 -2.537026 -0.932322
H  5.057917 -0.62522 0.005831
H  -1.759258 1.0887 2.457859
H  3.620724 2.820493 -1.75052
H  3.301948 3.063893 -0.048498
H  2.397847 1.84091 -0.941453
H  6.578885 1.13029 -0.128549
H  5.885735 2.685574 0.341535
H  6.13528 2.325165 -1.352335
H  -0.957978 2.178437 -0.202441
H  -1.981148 2.908859 1.019057
H  -3.225037 -2.238229 1.386254
H  -1.476549 -2.178624 1.212837
H  -2.217939 -1.571957 2.68156
H  -5.281712 0.070773 -0.736652
H  -4.775073 -1.401704 0.076629
H  -3.208579 -1.941695 -1.812367
H  -4.00362 -1.208186 -3.986124
H  -5.135195 0.010769 -3.187707
elementType: O C H
totalener: -965.41512941 hartree
nucrepener: 1842.45616804 hartree
electener: -2807.87129746 hartree
oneelecener: -4971.83158277 hartree
twoeener: 2163.96028532 hartree
cpcmener: -0.03933702 hartree
kineticenergy: 961.00164913 hartree
xcener: -95.143241110675 hartree
chargesum: 0.0000000
charge: -0.302759 -0.498834 -0.490689 0.159747 -0.030872 -0.104681 -0.291489 -0.289923 -0.300571 0.403283 -0.010661 0.296249 -0.242166 -0.229444 -0.156008 -0.004358 -0.124386 0.300386 -0.262223 -0.107873 -0.179993 -0.286126 0.104556 0.091519 0.098429 0.100398 0.093671 0.101940 0.097850 0.096012 0.126650 0.120366 0.101165 0.100129 0.078191 0.090006 0.094731 0.096585 0.115091 0.111268 0.107746 0.115468 0.117457 0.093325 0.111475 0.143725 0.131340 0.114295
qa: -0.3028 -0.4988 -0.4907 0.1597 -0.0309 -0.1047 -0.2915 -0.2899 -0.3006 0.4033 -0.0107 0.2962 -0.2422 -0.2294 -0.1560 -0.0044 -0.1244 0.3004 -0.2622 -0.1079 -0.1800 -0.2861 0.1046 0.0915 0.0984 0.1004 0.0937 0.1019 0.0979 0.0960 0.1267 0.1204 0.1012 0.1001 0.0782 0.0900 0.0947 0.0966 0.1151 0.1113 0.1077 0.1155 0.1175 0.0933 0.1115 0.1437 0.1313 0.1143
va: 2.1284 1.9993 2.0017 3.6847 3.8259 3.8206 3.9092 3.8883 3.8881 4.1345 3.7014 3.7631 3.9390 3.9298 3.8826 3.6793 3.4672 4.0556 3.9476 3.8695 3.7776 3.9465 1.0257 1.0339 1.0025 0.9992 1.0011 1.0024 0.9998 1.0165 1.0025 0.9914 0.9999 0.9977 1.0158 1.0060 0.9962 0.9960 1.0241 1.0223 1.0033 0.9955 0.9998 1.0210 1.0073 1.0007 1.0029 1.0128
dispcorr: -0.024203903 hartree
energy: -965.439333314431
dipole: 17.75747 -16.13987 1.61760 -7.73780 6.51213 -1.22567 0.40600 2.07133 2.47733
magnitude: 3.20251 au
magnitude: 8.14014 debye
