program: Orca
programVersion: 5.0.2
elementType: O O O C C C C C C C C C C C C C C C C C C C H H H H H H H H H H H H H H H H H H H H H H H H H H
charge: 0
multiplicity: 1
keywords: wb97x-d3
keywords: def2-TZVPP
keywords: def2/J RIJCOSX
keywords: DEFGRID2
keywords: scfconv7
keywords: smallprint printgap noloewdin
keywords: NOSOSCF
formula: C19H26O3
InChI: InChI=1/C19H26O3/c1-7-8-13-12(4)16(10-15(13)20)22-18(21)17-14(9-11(2)3)19(17,5)6/h7,9,14,16-17H,1,8,10H2,2-6H3
48 atoms
O  -0.111543 0.435981 1.522698
O  -0.081776 -0.276781 -0.59748
O  -3.595587 2.245064 -1.085156
C  2.480607 -1.808137 0.436304
C  2.871641 -0.62826 -0.382584
C  1.886119 -0.441102 0.756041
C  3.444624 -2.337991 1.469733
C  1.624904 -2.884702 -0.18399
C  4.216616 -0.002115 -0.29425
C  0.487144 -0.105324 0.457216
C  4.453798 1.303976 -0.440865
C  -1.47768 0.842706 1.430666
C  3.375109 2.311494 -0.697273
C  5.83872 1.865295 -0.337629
C  -1.762681 2.009301 0.489907
C  -2.422652 -0.251034 1.003641
C  -3.312104 0.191384 0.100598
C  -2.983249 1.565786 -0.282111
C  -2.337713 -1.602168 1.606677
C  -4.429756 -0.560815 -0.546661
C  -3.947598 -1.229609 -1.800867
C  -4.343297 -0.911635 -3.026794
H  2.406567 -0.591608 -1.364962
H  2.275147 0.021765 1.655647
H  4.021545 -1.547368 1.948781
H  2.906968 -2.875924 2.252262
H  4.148953 -3.036652 1.01427
H  0.971782 -3.344663 0.560538
H  1.004999 -2.521786 -1.000739
H  2.265031 -3.671543 -0.587693
H  5.057179 -0.665409 -0.109867
H  -1.7175 1.11759 2.45973
H  2.403514 1.86406 -0.89971
H  3.635319 2.945236 -1.548229
H  3.263057 2.980557 0.160322
H  5.894265 2.618252 0.452764
H  6.128942 2.368911 -1.262983
H  6.579811 1.095758 -0.123396
H  -0.942222 2.218038 -0.198143
H  -1.969401 2.935543 1.026478
H  -1.51306 -2.168946 1.16549
H  -2.144255 -1.544735 2.678661
H  -3.248008 -2.177126 1.446238
H  -5.25262 0.118922 -0.777275
H  -4.818558 -1.313103 0.143668
H  -3.20723 -2.012176 -1.66094
H  -3.9514 -1.423834 -3.896131
H  -5.073338 -0.131499 -3.208017
elementType: O C H
totalener: -965.41486772 hartree
nucrepener: 1844.97014379 hartree
electener: -2810.38501151 hartree
oneelecener: -4976.83925503 hartree
twoeener: 2166.45424352 hartree
cpcmener: -0.03934408 hartree
kineticenergy: 961.00918685 hartree
xcener: -95.144410327662 hartree
chargesum: 0.0000000
charge: -0.302350 -0.498425 -0.490659 0.157012 -0.022129 -0.108119 -0.289408 -0.290663 -0.305973 0.402323 -0.009141 0.293784 -0.243342 -0.229044 -0.154713 -0.003978 -0.122076 0.299425 -0.266123 -0.106650 -0.181799 -0.284804 0.105069 0.091521 0.093899 0.098140 0.100087 0.098035 0.095533 0.101698 0.125480 0.120247 0.079473 0.101480 0.102041 0.094677 0.096839 0.090093 0.114782 0.111936 0.116249 0.118116 0.109128 0.090016 0.112523 0.143930 0.131578 0.114283
qa: -0.3024 -0.4984 -0.4907 0.1570 -0.0221 -0.1081 -0.2894 -0.2907 -0.3060 0.4023 -0.0091 0.2938 -0.2433 -0.2290 -0.1547 -0.0040 -0.1221 0.2994 -0.2661 -0.1066 -0.1818 -0.2848 0.1051 0.0915 0.0939 0.0981 0.1001 0.0980 0.0955 0.1017 0.1255 0.1202 0.0795 0.1015 0.1020 0.0947 0.0968 0.0901 0.1148 0.1119 0.1162 0.1181 0.1091 0.0900 0.1125 0.1439 0.1316 0.1143
va: 2.1267 2.0008 2.0019 3.6849 3.8197 3.8195 3.9077 3.8909 3.8931 4.1342 3.6997 3.7674 3.9378 3.9303 3.8763 3.6786 3.4670 4.0544 3.9454 3.8701 3.7811 3.9462 1.0251 1.0337 1.0015 1.0025 0.9995 0.9997 1.0166 1.0023 1.0029 0.9914 1.0150 1.0003 0.9974 0.9959 0.9964 1.0058 1.0243 1.0219 0.9952 1.0008 1.0024 1.0235 1.0060 1.0002 1.0026 1.0124
dispcorr: -0.024349106 hartree
energy: -965.439216824721
dipole: 17.67285 -16.05737 1.61548 -7.96771 6.74487 -1.22284 0.71946 1.79303 2.51250
magnitude: 3.22765 au
magnitude: 8.20404 debye
