program: Orca
programVersion: 5.0.2
elementType: O O O C C C C C C C C C C C C C C C C C C C H H H H H H H H H H H H H H H H H H H H H H H H H H
charge: 0
multiplicity: 1
keywords: wb97x-d3
keywords: def2-TZVPP
keywords: def2/J RIJCOSX
keywords: DEFGRID2
keywords: scfconv7
keywords: smallprint printgap noloewdin
keywords: NOSOSCF
formula: C19H26O3
InChI: InChI=1/C19H26O3/c1-7-8-13-12(4)16(10-15(13)20)22-18(21)17-14(9-11(2)3)19(17,5)6/h7,9,14,16-17H,1,8,10H2,2-6H3
48 atoms
O  -0.10115 0.216418 1.298427
O  0.215731 -0.228819 -0.87164
O  -3.639885 2.039949 -1.277872
C  2.728968 -1.720781 0.393011
C  3.136736 -0.504498 -0.365019
C  2.040742 -0.388054 0.671218
C  3.617421 -2.226369 1.502974
C  1.9891 -2.822005 -0.325055
C  4.441594 0.169058 -0.134444
C  0.653304 -0.135858 0.25301
C  4.627709 1.491254 -0.134179
C  -1.487789 0.496487 1.108995
C  3.522301 2.477786 -0.354045
C  5.979712 2.091073 0.102123
C  -1.814273 1.743042 0.293955
C  -2.273874 -0.618202 0.464476
C  -3.145312 -0.140163 -0.439252
C  -2.967224 1.306995 -0.576983
C  -2.102611 -2.017595 0.921112
C  -4.212581 -0.86527 -1.194584
C  -5.548211 -0.656226 -0.542041
C  -6.555818 0.019819 -1.079578
H  2.775338 -0.474621 -1.390574
H  2.314494 0.071211 1.614399
H  4.389027 -2.888312 1.104703
H  4.115147 -1.419481 2.040353
H  3.035705 -2.797562 2.228388
H  1.313421 -3.34687 0.353436
H  1.407983 -2.465643 -1.172919
H  2.703193 -3.554012 -0.707076
H  5.301703 -0.475199 0.026363
H  -1.852242 0.613207 2.13205
H  2.587221 2.016935 -0.66683
H  3.806405 3.207811 -1.115501
H  3.326672 3.046947 0.558796
H  6.735944 1.334219 0.308857
H  5.955694 2.785656 0.945642
H  6.307925 2.670914 -0.764203
H  -0.984905 2.071377 -0.335139
H  -2.097967 2.591121 0.917539
H  -1.113645 -2.401335 0.658652
H  -2.181234 -2.075694 2.008556
H  -2.84288 -2.686374 0.487682
H  -3.983932 -1.932379 -1.231545
H  -4.241419 -0.510115 -2.227085
H  -5.659217 -1.084799 0.4498
H  -7.493946 0.146121 -0.554471
H  -6.483442 0.467357 -2.064023
elementType: O C H
totalener: -965.41479923 hartree
nucrepener: 1824.87291470 hartree
electener: -2790.28771393 hartree
oneelecener: -4936.43519230 hartree
twoeener: 2146.14747836 hartree
cpcmener: -0.03934303 hartree
kineticenergy: 961.00615158 hartree
xcener: -95.144536709959 hartree
chargesum: 0.0000000
charge: -0.300423 -0.495078 -0.492218 0.161822 -0.008280 -0.129589 -0.287840 -0.299856 -0.309751 0.404220 -0.012254 0.283460 -0.239900 -0.229882 -0.153162 0.012977 -0.129443 0.303897 -0.257366 -0.117100 -0.175073 -0.290357 0.103812 0.095726 0.099675 0.093861 0.098471 0.098670 0.096724 0.103799 0.124912 0.121293 0.079131 0.101437 0.101953 0.089878 0.094472 0.097426 0.115804 0.108416 0.116751 0.115175 0.104849 0.108846 0.099987 0.144440 0.131166 0.114521
qa: -0.3004 -0.4951 -0.4922 0.1618 -0.0083 -0.1296 -0.2878 -0.2999 -0.3098 0.4042 -0.0123 0.2835 -0.2399 -0.2299 -0.1532 0.0130 -0.1294 0.3039 -0.2574 -0.1171 -0.1751 -0.2904 0.1038 0.0957 0.0997 0.0939 0.0985 0.0987 0.0967 0.1038 0.1249 0.1213 0.0791 0.1014 0.1020 0.0899 0.0945 0.0974 0.1158 0.1084 0.1168 0.1152 0.1048 0.1088 0.1000 0.1444 0.1312 0.1145
va: 2.1281 2.0078 1.9999 3.6790 3.8114 3.8250 3.9049 3.8944 3.8933 4.1427 3.7019 3.7821 3.9347 3.9314 3.8964 3.6393 3.4829 4.0504 3.9526 3.8753 3.7775 3.9521 1.0254 1.0315 0.9998 1.0019 1.0027 0.9991 1.0152 1.0031 1.0029 0.9920 1.0158 1.0002 0.9978 1.0059 0.9963 0.9962 1.0239 1.0242 0.9942 0.9982 1.0037 1.0070 1.0176 0.9999 1.0030 1.0122
dispcorr: -0.024067609 hartree
energy: -965.438866843497
dipole: 16.63810 -14.95511 1.68300 -6.43321 4.95943 -1.47378 3.62789 -1.31331 2.31457
magnitude: 3.21897 au
magnitude: 8.18197 debye
