program: Orca
programVersion: 5.0.2
elementType: O O O C C C C C C C C C C C C C C C C C C C H H H H H H H H H H H H H H H H H H H H H H H H H H
charge: 0
multiplicity: 1
keywords: wb97x-d3
keywords: def2-TZVPP
keywords: def2/J RIJCOSX
keywords: DEFGRID2
keywords: scfconv7
keywords: smallprint printgap noloewdin
keywords: NOSOSCF
formula: C19H26O3
InChI: InChI=1/C19H26O3/c1-7-8-13-12(4)16(10-15(13)20)22-18(21)17-14(9-11(2)3)19(17,5)6/h7,9,14,16-17H,1,8,10H2,2-6H3
48 atoms
O  -0.123524 0.20454 1.395222
O  0.208524 -0.182681 -0.783062
O  -3.62854 2.050186 -1.203839
C  2.708685 -1.718104 0.438201
C  3.11923 -0.476943 -0.274686
C  2.020704 -0.396948 0.766743
C  3.591609 -2.267946 1.531537
C  1.969833 -2.791362 -0.322644
C  4.422866 0.194515 -0.036904
C  0.637519 -0.125093 0.347196
C  4.646472 1.49816 -0.223179
C  -1.510294 0.4829 1.199916
C  3.585923 2.458457 -0.666532
C  6.002302 2.097788 -0.009937
C  -1.836824 1.74199 0.404269
C  -2.281966 -0.625325 0.526956
C  -3.141443 -0.138437 -0.383306
C  -2.968295 1.31149 -0.49729
C  -2.105486 -2.031162 0.961932
C  -4.185584 -0.858435 -1.17456
C  -5.543953 -0.642281 -0.573036
C  -6.526752 0.039102 -1.148322
H  2.748842 -0.405821 -1.294417
H  2.291262 0.025109 1.727864
H  4.076464 -1.484986 2.114116
H  3.00734 -2.878583 2.221934
H  4.372737 -2.903807 1.109934
H  1.292017 -3.341015 0.333868
H  1.391224 -2.403499 -1.158345
H  2.685076 -3.508896 -0.729499
H  5.251896 -0.433267 0.277295
H  -1.883643 0.57812 2.221913
H  3.806024 2.838366 -1.669181
H  3.555609 3.330663 -0.007598
H  2.588301 2.019826 -0.689966
H  6.738288 1.353873 0.295257
H  5.969144 2.876332 0.756552
H  6.365469 2.579076 -0.921889
H  -0.999921 2.095151 -0.200925
H  -2.14365 2.572696 1.04023
H  -2.183195 -2.107183 2.048343
H  -2.842687 -2.696493 0.517875
H  -1.114958 -2.406887 0.69288
H  -3.961603 -1.926805 -1.202018
H  -4.174313 -0.504886 -2.208187
H  -5.695512 -1.071509 0.413129
H  -7.484182 0.169149 -0.660196
H  -6.413811 0.487922 -2.128417
elementType: O C H
totalener: -965.41491424 hartree
nucrepener: 1822.74049324 hartree
electener: -2788.15540747 hartree
oneelecener: -4932.22397531 hartree
twoeener: 2144.06856784 hartree
cpcmener: -0.03946104 hartree
kineticenergy: 960.99669541 hartree
xcener: -95.142656359445 hartree
chargesum: -0.0000000
charge: -0.300639 -0.495607 -0.492038 0.168557 -0.032541 -0.114867 -0.293248 -0.295217 -0.294742 0.404617 -0.015753 0.285429 -0.244051 -0.228714 -0.152167 0.014624 -0.131901 0.302003 -0.257822 -0.117286 -0.174146 -0.290986 0.104009 0.092961 0.093347 0.098214 0.100719 0.098022 0.096905 0.103906 0.126939 0.121206 0.103828 0.095323 0.079308 0.089540 0.095833 0.095564 0.115639 0.108838 0.115135 0.105224 0.116426 0.108429 0.101109 0.144496 0.131098 0.114478
qa: -0.3006 -0.4956 -0.4920 0.1686 -0.0325 -0.1149 -0.2932 -0.2952 -0.2947 0.4046 -0.0158 0.2854 -0.2441 -0.2287 -0.1522 0.0146 -0.1319 0.3020 -0.2578 -0.1173 -0.1741 -0.2910 0.1040 0.0930 0.0933 0.0982 0.1007 0.0980 0.0969 0.1039 0.1269 0.1212 0.1038 0.0953 0.0793 0.0895 0.0958 0.0956 0.1156 0.1088 0.1151 0.1052 0.1164 0.1084 0.1011 0.1445 0.1311 0.1145
va: 2.1294 2.0079 2.0002 3.6804 3.8294 3.8205 3.9093 3.8876 3.8804 4.1455 3.7074 3.7794 3.9413 3.9284 3.8955 3.6381 3.4817 4.0520 3.9529 3.8761 3.7762 3.9524 1.0255 1.0338 1.0015 1.0028 0.9990 0.9996 1.0153 1.0029 1.0024 0.9918 0.9979 0.9996 1.0147 1.0064 0.9968 0.9952 1.0239 1.0239 0.9984 1.0036 0.9938 1.0074 1.0167 1.0000 1.0031 1.0121
dispcorr: -0.023863543 hartree
energy: -965.438777781881
dipole: 16.77269 -15.10623 1.66646 -6.58997 5.04907 -1.54090 2.40031 -0.16316 2.23715
magnitude: 3.18689 au
magnitude: 8.10044 debye
