program: Orca
programVersion: 5.0.2
elementType: O O O C C C C C C C C C C C C C C C C C C C H H H H H H H H H H H H H H H H H H H H H H H H H H
charge: 0
multiplicity: 1
keywords: wb97x-d3
keywords: def2-TZVPP
keywords: def2/J RIJCOSX
keywords: DEFGRID2
keywords: scfconv7
keywords: smallprint printgap noloewdin
keywords: NOSOSCF
formula: C19H26O3
InChI: InChI=1/C19H26O3/c1-7-8-13-12(4)16(10-15(13)20)22-18(21)17-14(9-11(2)3)19(17,5)6/h7,9,14,16-17H,1,8,10H2,2-6H3
48 atoms
O  -0.076396 0.333077 0.784756
O  0.353862 -0.093292 2.938957
O  -3.696992 2.060935 -1.389416
C  2.237458 -1.603329 0.225381
C  2.655026 -0.181051 0.014178
C  2.013642 -0.588057 1.335137
C  3.274026 -2.66123 0.523043
C  1.082565 -2.145575 -0.583957
C  4.064772 0.253755 0.006243
C  0.694974 -0.10243 1.775675
C  4.563694 1.327618 -0.616166
C  -1.396201 0.82127 1.051957
C  3.764282 2.305091 -1.421763
C  6.028042 1.64199 -0.542396
C  -1.744184 1.906365 0.043556
C  -2.419039 -0.267699 0.828992
C  -3.345151 0.100127 -0.071164
C  -3.029602 1.434916 -0.589269
C  -2.348623 -1.543552 1.580646
C  -4.515283 -0.676088 -0.583058
C  -4.143381 -1.391733 -1.84974
C  -4.62186 -1.097896 -3.052102
H  1.996675 0.37274 -0.644843
H  2.693346 -0.696308 2.172968
H  2.801497 -3.529624 0.985094
H  3.754008 -2.997575 -0.397787
H  4.053913 -2.317969 1.201143
H  0.403014 -1.377078 -0.943742
H  1.472272 -2.66696 -1.460221
H  0.504306 -2.869799 -0.006391
H  4.758795 -0.361867 0.570628
H  -1.454355 1.190534 2.077733
H  3.92813 3.320762 -1.053435
H  2.692325 2.119992 -1.409057
H  4.090376 2.30268 -2.464868
H  6.195839 2.614735 -0.072746
H  6.466041 1.704613 -1.541817
H  6.583279 0.894084 0.023005
H  -0.975872 2.005197 -0.726442
H  -1.873007 2.887321 0.501516
H  -3.21237 -2.177385 1.391467
H  -1.456706 -2.111124 1.30352
H  -2.283923 -1.356949 2.653752
H  -5.354755 -0.002264 -0.766573
H  -4.841869 -1.399246 0.167191
H  -3.40806 -2.184193 -1.743236
H  -4.303872 -1.640475 -3.933182
H  -5.349302 -0.308482 -3.200846
elementType: O C H
totalener: -965.41635167 hartree
nucrepener: 1821.37113223 hartree
electener: -2786.78748391 hartree
oneelecener: -4928.52416337 hartree
twoeener: 2141.73667947 hartree
cpcmener: -0.03831610 hartree
kineticenergy: 960.99690855 hartree
xcener: -95.141729676600 hartree
chargesum: -0.0000000
charge: -0.277557 -0.498805 -0.483456 0.122125 0.034278 -0.099497 -0.288595 -0.297779 -0.292562 0.418553 -0.038270 0.220616 -0.256048 -0.223671 -0.136928 -0.036365 -0.070796 0.305284 -0.256973 -0.100058 -0.180597 -0.284801 0.106820 0.091401 0.097813 0.099545 0.092217 0.091140 0.103656 0.101692 0.119290 0.112371 0.094691 0.089602 0.098324 0.094367 0.093081 0.088887 0.103451 0.105043 0.105489 0.118145 0.119140 0.093895 0.111595 0.144072 0.132117 0.114060
qa: -0.2776 -0.4988 -0.4835 0.1221 0.0343 -0.0995 -0.2886 -0.2978 -0.2926 0.4186 -0.0383 0.2206 -0.2560 -0.2237 -0.1369 -0.0364 -0.0708 0.3053 -0.2570 -0.1001 -0.1806 -0.2848 0.1068 0.0914 0.0978 0.0995 0.0922 0.0911 0.1037 0.1017 0.1193 0.1124 0.0947 0.0896 0.0983 0.0944 0.0931 0.0889 0.1035 0.1050 0.1055 0.1181 0.1191 0.0939 0.1116 0.1441 0.1321 0.1141
va: 2.1119 1.9947 2.0092 3.6727 3.7704 3.8295 3.9155 3.9047 3.8770 4.1700 3.7554 3.7526 3.9415 3.9232 3.9301 3.7445 3.4398 4.0522 3.9371 3.8607 3.7851 3.9466 1.0112 1.0314 1.0004 1.0004 1.0070 1.0148 1.0025 0.9962 1.0117 1.0281 0.9970 1.0121 0.9963 0.9963 0.9956 1.0084 1.0276 1.0218 1.0063 0.9929 1.0054 1.0223 1.0058 1.0004 1.0026 1.0132
dispcorr: -0.023547197 hartree
energy: -965.439898869403
dipole: 16.95595 -15.66052 1.29544 -7.90018 6.64781 -1.25236 -7.38395 7.47866 0.09471
magnitude: 1.80431 au
magnitude: 4.58620 debye
