program: Orca
programVersion: 5.0.2
elementType: O O O C C C C C C C C C C C C C C C C C C C H H H H H H H H H H H H H H H H H H H H H H H H H H
charge: 0
multiplicity: 1
keywords: wb97x-d3
keywords: def2-TZVPP
keywords: def2/J RIJCOSX
keywords: DEFGRID2
keywords: scfconv7
keywords: smallprint printgap noloewdin
keywords: NOSOSCF
formula: C19H26O3
InChI: InChI=1/C19H26O3/c1-7-8-13-12(4)16(10-15(13)20)22-18(21)17-14(9-11(2)3)19(17,5)6/h7,9,14,16-17H,1,8,10H2,2-6H3
48 atoms
O  -0.008756 0.177547 0.536433
O  0.24701 -0.463501 2.665354
O  -3.63351 2.04964 -1.59943
C  2.453672 -1.569421 -0.002116
C  2.818373 -0.117176 -0.002363
C  2.070496 -0.703377 1.187354
C  3.503095 -2.61843 0.280493
C  1.415102 -2.0514 -0.987083
C  4.198489 0.366537 0.190595
C  0.692017 -0.329485 1.545315
C  4.727892 1.488796 -0.309209
C  -1.378024 0.549378 0.723526
C  3.997837 2.480431 -1.16243
C  6.158397 1.845025 -0.036006
C  -1.708531 1.748446 -0.151879
C  -2.29845 -0.548959 0.248523
C  -3.176465 -0.099339 -0.662284
C  -2.944038 1.326583 -0.906447
C  -2.214476 -1.912977 0.821615
C  -4.286503 -0.839994 -1.323382
C  -5.607631 -0.733097 -0.61963
C  -5.838335 -0.1322 0.541233
H  2.203489 0.484345 -0.661549
H  2.670671 -0.884198 2.072081
H  3.027607 -3.544211 0.609299
H  4.07314 -2.843244 -0.622938
H  4.207678 -2.321647 1.055903
H  0.757054 -1.264216 -1.346638
H  1.91798 -2.473554 -1.859152
H  0.798528 -2.841919 -0.554141
H  4.840056 -0.256017 0.806971
H  -1.565283 0.76209 1.778071
H  4.050908 3.476813 -0.716992
H  2.947309 2.244211 -1.316265
H  4.468247 2.560602 -2.145731
H  6.71922 1.953328 -0.96806
H  6.661473 1.095515 0.574394
H  6.231757 2.80637 0.479102
H  -0.908287 1.9541 -0.867009
H  -1.881618 2.662292 0.416159
H  -2.994843 -2.567766 0.439937
H  -1.250078 -2.376028 0.60005
H  -2.302941 -1.873273 1.909013
H  -4.030396 -1.897875 -1.427625
H  -4.409929 -0.475617 -2.347611
H  -6.434179 -1.209191 -1.137852
H  -6.832659 -0.116618 0.968231
H  -5.059347 0.359332 1.112038
elementType: O C H
totalener: -965.41678714 hartree
nucrepener: 1817.39843654 hartree
electener: -2782.81522368 hartree
oneelecener: -4920.51201019 hartree
twoeener: 2137.69678651 hartree
cpcmener: -0.03933121 hartree
kineticenergy: 961.00268770 hartree
xcener: -95.145427283640 hartree
chargesum: -0.0000000
charge: -0.276907 -0.499506 -0.484239 0.119730 0.038374 -0.101687 -0.285334 -0.301805 -0.290767 0.419936 -0.044238 0.216866 -0.254636 -0.221999 -0.130234 -0.017555 -0.092568 0.317497 -0.252194 -0.092647 -0.188143 -0.280653 0.107891 0.089960 0.098676 0.097866 0.091539 0.092823 0.103419 0.103439 0.118776 0.111591 0.094909 0.089904 0.097791 0.093197 0.088902 0.093949 0.104018 0.100323 0.103744 0.122099 0.118302 0.104561 0.096484 0.133267 0.133645 0.111633
qa: -0.2769 -0.4995 -0.4842 0.1197 0.0384 -0.1017 -0.2853 -0.3018 -0.2908 0.4199 -0.0442 0.2169 -0.2546 -0.2220 -0.1302 -0.0176 -0.0926 0.3175 -0.2522 -0.0926 -0.1881 -0.2807 0.1079 0.0900 0.0987 0.0979 0.0915 0.0928 0.1034 0.1034 0.1188 0.1116 0.0949 0.0899 0.0978 0.0932 0.0889 0.0939 0.1040 0.1003 0.1037 0.1221 0.1183 0.1046 0.0965 0.1333 0.1336 0.1116
va: 2.1118 1.9941 2.0104 3.6587 3.7703 3.8298 3.9152 3.9063 3.8723 4.1683 3.7619 3.7701 3.9406 3.9218 3.9327 3.7175 3.4382 4.0378 3.9360 3.8403 3.8249 3.9054 1.0102 1.0322 1.0002 1.0010 1.0075 1.0132 1.0027 0.9952 1.0123 1.0320 0.9970 1.0120 0.9965 0.9956 1.0087 0.9964 1.0251 1.0238 1.0048 0.9923 1.0038 1.0010 1.0144 1.0024 1.0034 1.0151
dispcorr: -0.023780979 hartree
energy: -965.440568116939
dipole: 17.17247 -15.65497 1.51750 -6.10057 4.72079 -1.37978 -4.14101 3.77590 -0.36511
magnitude: 2.08324 au
magnitude: 5.29518 debye
